{"text_format":"1","workbook":"xlsx","n_sheets":23,"sheets":["Page 1 of 8","Page 2 of 8","Page 3 of 8","Page 4 of 8","Page 5 of 8","Page 6 of 8","Page 7 of 8","Page 8 of 8","Data Collections","Page 8 of 8 (2)","PDF of Signature","Supplement Page 1 of 3","Supplement Page 2 of 3","Supplement Page 3 of 3","Supplement Page 4","Supplement Page 5","Supplement Page 6","Supplement Page 7","Supplement Page 8","Supplement Page 7b","Supplement Page 8b","Sheet1","Sheet2"],"not_rendered":{"charts":0,"images":16,"macros":1,"external_links":2,"defined_names":30,"comments":0,"pivot_tables":0},"unopened":[],"bounds":{"document_bytes":16777216,"sheet_cells":100000,"rows_first":2000,"rows_last":500,"rows_between":2000,"halvings":0,"cell_chars":16384,"cell_head_chars":4096},"cells_cut":0,"cells_raw":0,"read":"whole","date_system":"1900"}

{"sheet":"Page 1 of 8","index":0,"n_rows":39,"n_cols":10,"rows_kept":39,"cut":false,"hidden":false,"merged":[[32,3,32,7],[33,3,33,7],[38,1,38,9],[39,1,39,9],[34,1,34,9],[31,3,31,7],[31,8,31,9],[19,1,19,9],[20,2,22,7],[23,2,23,7],[25,2,25,7],[25,8,25,9],[26,3,27,7],[28,3,28,7],[29,3,29,7],[29,8,29,9],[30,3,30,7],[30,8,30,9],[16,1,16,9],[7,4,7,5],[8,4,8,5],[9,4,9,5],[10,4,10,5],[11,4,11,5],[11,7,11,9],[12,1,12,4],[12,5,13,9],[13,1,13,4],[14,1,14,9],[15,1,15,9],[5,4,6,5],[0,1,0,9],[1,1,1,9],[2,1,2,9],[3,1,3,9],[4,4,4,5]]}
[null,"OMB No. 0581-0274"]
[null,"DAIRY PRODUCT MANDATORY REPORTING PROGRAM"]
[null,"DAIRY PRODUCT SALES SURVEY"]
[null,"Annual Validation Worksheet"]
[]
[null,null,null,null,null,null,"U.S. Department of Agriculture, "]
[null,null,null,null,null,null,"Rm. 2530, South Building"]
[null," ",null,null,null,null,"1400 Independence  Ave., S.W."]
[null,null,null,null,null,null,"Washington, DC 20250-0225"]
[null,null,null,null,null,null,"Phone: 202-720-4392"]
[null,null,null,null,null,null,"Fax: 202-690-3410"]
[null,null,null,null,null,null,"Email: ","DPP@ams.usda.gov "]
[null,"According to the Paperwork Reduction Act of 1995, an agency may not conduct or sponsor, and a person is not required to respond to a collection of information unless it displays a valid OMB control  number.  The valid OMB control number for this information collection is 0581-0274.  The time required to complete this information collection is estimated  to average 20 minutes per response, including the time for reviewing instructions, searching existing data sources, gathering and maintaining the data needed, and completing and reviewing the collection of information.",null,null,null,"USDA AMS collects weekly information on the sales of dairy products such as cheddar cheese to be published in the Dairy Products  Sales Release. The information you provide is important to establish  U.S. dairy product prices used in setting minimum  class prices under the  Federal Milk Order program. An  accurate response to  this survey is mandatory and subject to verification by the AMS under Public Law No. 106-532.  This law specifically protects the  confidentiality of  your report from public disclosure except as directed by the US Secretary  of Agriculture or the US Attorney General for  enforcement purposes to ensure compliance with  the Dairy Product Mandatory Reporting program."]
[null,"In accordance with Federal civil rights law and U.S. Department of Agriculture (USDA) civil rights regulations and policies, the USDA, its Agencies, offices, and employees, and institutions participating in or administering USDA programs are prohibited from discriminating based on race, color, national origin, religion, sex, disability, age, marital status, family/parental status, income derived from a public assistance program, political beliefs, or reprisal or retaliation for prior civil rights activity, in any program or activity conducted or funded by USDA (not all bases apply to all programs). Remedies and complaint filing deadlines vary by program or incident."]
[]
[null,"This worksheet should be completed by an AMS representative with the owner or manager making day-to-day marketing decisions and all other employees (including primary and secondary reporters) working on the weekly Dairy Product Mandatory Reporting Program (DPMRP) Dairy Product Sales Survey."]
[null,"List the names of all those who attended the meeting and any changes that could affect DPMRP reporting since the last Dairy Product Sales Survey was completed. (i.e. change in personnel, equipment, software, production):"]
[]
[]
[]
[null,"1.","Does this plant/company own or partially own other plants/companies producing or selling dairy products, have tolling agreements with other plants/companies, or have an exclusive marketing agreement with other plants/companies?",null,null,null,null,null,null,"Yes                No"]
[]
[]
[null,null,"[Interviewer Note:  If yes, complete the Supplement. If no, continue.]. . . . . . . . . . . . . . . . . . . . . . . . . . . "]
[]
[null,"2.  ","In a calendar year, does this plant/company sell one million pounds of:"]
[null,null,"a.   ","Cheddar cheese in 40 pound blocks, colored between 6 and 8 on the National Cheese Institute color chart, meeting Wisconsin State Brand, USDA Grade A, or better standards? "]
[]
[null,null,null,"[Interviewer Note: If yes, complete Section 1a and 1b.]   . . . . . . . . . . . . . . . . . . . . . . . . . . . . . . . . . . . . ."]
[null,null,"b. ","Cheddar cheese in 500 pound barrels, white, meeting Wisconsin State Brand, USDA Extra Grade, or better standards? [Interviewer Note: If yes, complete Section 1a and1c]. . . . . . . . . . . . . . . . . . . . . . . . . . . . . . . . . . . . . . . . . "]
[null,null,"c. ","Salted butter (80% butterfat), fresh or storage, in 25 kilogram and 68 pound boxes meeting USDA Grade AA standards? [Interviewer Note: If yes, complete Section 2]. . . . . . . . . . . . . . . . . . . . . . . . . . . . . . ."]
[null,null,"d.  ","Non-fortified, nonfat dry milk in 25 kilogram bags, 50 pound bags, totes, and tankers meeting USDA Extra Grade or USPH Grade A standards?"]
[null,null,null,"[Interviewer Note: If yes, complete Section 3]. . . . . . . . . . . . . . . . . . . . . . . . . . . . . . . . . . . . . . . . . . . . . . . . . . . . . . . . . . . . . . ."]
[null,null,"e. "," Edible non-hygroscopic dry whey in 25 kilogram bags, 50 pound bags, totes, and tankers meeting USDA Extra Grade standards? [Interviewer Note: If yes, complete Section 4]. . . . . . . . . . . . . . . . . . . . . . . ."]
[null,"3.  If all of the above are checked “No”, please explain:  (Shift+Enter or Ctrl+Enter for a new line in text box below)"]
[]
[]
[]
[null,"Interviewer Note: If all parts of Question 2 are “no”, skip to Page 8 of 8. If any are checked “yes” complete all applicable commodity sections."]

{"sheet":"Page 2 of 8","index":1,"n_rows":35,"n_cols":7,"rows_kept":35,"cut":false,"hidden":false,"merged":[[39,1,39,6],[1,1,1,3],[1,6,4,6],[3,2,3,4],[4,2,4,4],[5,2,5,4],[18,3,18,4]]}
[]
[null,"Section 1a – All Cheddar Cheese Sales",null,null,null,null,"Responsible reporting party understands and is currently reporting or can report based on each specification listed below"]
[null,"1. The following are the specifications for reporting weekly Cheddar Cheese sales data"]
[null,null,"to AMS.  Please review with the responsible reporting party and verify: "]
[null,null,"-Current Reporting Plants/Companies understand and are reporting based on each specification listed below. Discuss and answer any questions. "]
[null,null,"-Potential Reporting Plants/Companies understand and can report based on each specification listed below. Discuss and answer any questions. ",null,null,null,"N/A = Not Applicable - the specification does not apply to the plant/company (i.e. No organic production)"]
[null,null,null,null,null,null,"Yes          No          N/A   "]
[null,null,"a.   ","Report price as f.o.b. plant  if the product is “shipped out” from a plant/company.  . . . . ."]
[null,null,"b.  ","Report price as f.o.b. storage  facility  if the product is “shipped out” from a storage"]
[null,null,null,"facility.   . . . . . . . . . . . . . . . . . . . . . . . . . . . . . . . . . . . . . . . . . . . . . . . . . . . . . . . . . . . . . . . . ."]
[]
[null,null,"c.  ","Report only complete transactions, i.e. cheddar cheese is “shipped  out” and title "]
[null,null,null,"transfer occurs.    . . . . . . . . . . . . . . . . . . . . . . . . . . . . . . . . . . . . . . . . . . . . . . . . . . . . . . . . . "]
[null,null,"d.  ","Report only sales of cheddar cheese 4 to 30 days in age.   . . . . . . . . . . . . . . . . . . . . . . . . ."]
[]
[null,null,"e.  ","Report prices without deduction for brokerage fees paid by the manufacturer.   . . . . . . . "]
[null,null,"f.  ","Report prices without deduction for clearing charges paid by the manufacturer.   . . . . . ."]
[null,null,null,null," "]
[null,null,"g.  ","Include sales of products labeled or contracted as sourced from cows not treated with"]
[null,null,null," recombinant bovine somatotropin (rBST).   . . . . . . . . . . . . . . . . . . . . . . . . . . . . . . . . . ."]
[null,null,"h.  ","Exclude forward pricing sales: sales in which the selling price is established (and not "]
[null,null,null," adjusted) 30 or more days before the transaction is completed.   . . . . . . . . . . . . . . . . . . ."]
[null,null,null,null," "]
[null,null,"i. ","Exclude intra-company sales of cheddar  cheese.   . . . . . . . . . . . . . . . . . . . . . . . . . . . . . ."]
[null,null,"j.  ","Exclude re-sales of purchased  cheddar  cheese.    . . . . . . . . . . . . . . . . . . . . . . . . . . . . . . ."]
[]
[null,null,"k.  ","Exclude cheddar cheese certified as organic by a USDA-accredited certifying agent.  . . ."]
[null,null,"l. ","Exclude sales of cheddar cheese produced under faith-based close supervision and "]
[null,null,null,"marketed at a higher price than the manufacturer’s wholesale market price for the"]
[null,null,null,"basic commodity (for example, kosher cheddar cheese produced with a rabbi on site "]
[null,null,null,"who is actively involved in the supervision of the production process).   . . . . . . . . . . . . . . "]
[null,null,null,null," "]
[null,null,"m.  ","Exclude sales of  premium assisted sales (for example: export  assistance sales through"]
[null,null,null," the Cooperatives Working Together (CWT) program).   . . . . . . . . . . . . . . . . . . . . . . . . . . ."]
[null,"2.  If any of the above are checked “No” or \"N/A\", please explain:"]

{"sheet":"Page 3 of 8","index":2,"n_rows":35,"n_cols":7,"rows_kept":35,"cut":false,"hidden":false,"merged":[[21,1,21,4],[21,6,24,6],[23,2,23,4],[24,2,24,4],[25,2,25,4],[5,2,5,4],[1,1,1,3],[1,6,4,6],[2,5,3,5],[3,2,3,4],[4,2,4,4]]}
[]
[null,"Section 1b – Cheddar Cheese 40 Pound Block Sales",null,null,null,null,"Responsible reporting party understands and is currently reporting or can report based on each specification listed below"]
[null,"1. The following are the specifications for reporting weekly Cheddar Cheese sales in"]
[null,null,"40 pound Blocks to AMS.  Please review with the responsible reporting party and verify: "]
[null,null,"-Current Reporting Plants/Companies understand and are reporting based on each specification listed below. Discuss and answer any questions. "]
[null,null,"-Potential Reporting Plants/Companies understand and can report based on each specification listed below. Discuss and answer any questions. ",null,null,null,"N/A = Not Applicable - the specification does not apply to the plant/company (i.e. No organic production)"]
[null,null,null,null,null,null,"Yes          No           N/A   "]
[null,null,"a.   ","Report only cheese colored between 6 and 8 on the National Cheese"," "]
[null,null,null,"institute color  chart.   . . . . . . . . . . . . . . . . . . . . . . . . . . . . . . . . . . . . . . . . . . . . . . . . . . . . ."]
[null,null,"b.  ","Report only cheese meeting Wisconsin State Brand, USDA Grade A,"," "]
[null,null,null,"or better standards.   . . . . . . . . . . . . . . . . . . . . . . . . . . . . . . . . . . . . . . . . . . . . . . . . . . . . . ."]
[null,null,"c.  ","Report price reflecting packaging costs for cheese wrapped in"]
[null,null,null,"a sealed, airtight package in corrugated or solid fiberboard container "]
[null,null,null,"with a reinforcing inner liner or sleeve (excluding all other packaging"," "]
[null,null,null,"cost from the reported  price).   . . . . . . . . . . . . . . . . . . . . . . . . . . . . . . . . . . . . . . . . . . . . . ."]
[null,null,"d.  ","Exclude all cheese that will be aged.   . . . . . . . . . . . . . . . . . . . . . . . . . . . . . . . . . . . . . . . ."]
[null,"2.   If any of the above are checked “No” or \"N/A\", please explain:"]
[]
[]
[]
[]
[null,"Section 1c – Cheddar Cheese 500 Pound Barrel Sales",null,null,null,null,"Responsible reporting party understands and is currently reporting or can report based on each specification listed below"]
[null,"1. The following are the specifications for reporting weekly Cheddar Cheese sales in 500"]
[null,null,"Pound Barrels to AMS.  Please review with the responsible reporting party and verify: "]
[null,null,"-Current Reporting Plants/Companies  understand and are reporting based on each specification listed below. Discuss and answer any questions. "]
[null,null,"-Potential Reporting Plants/Companies understand and can report based on each specification listed below. Discuss and answer any questions. ",null,null,null,"N/A = Not Applicable - the specification does not apply to the plant/company (i.e. No organic production)"]
[null,null,null,null," ",null,"Yes          No           N/A   "]
[null,null,"a.  ","Report only white  cheese.   . . . . . . . . . . . . . . . . . . . . . . . . . . . . . . . . . . . . . . . . . . . . . . . . ."]
[null,null,"b. ","Report only cheese meeting Wisconsin State Brand, USDA Extra Grade,"," "]
[null,null,null,"or better standards.   . . . . . . . . . . . . . . . . . . . . . . . . . . . . . . . . . . . . . . . . . . . . . . . . . . . . . ."]
[null,null,"c. ","Report the moisture content of the cheddar  cheese.   . . . . . . . . . . . . . . . . . . . . . . . . . . ."]
[null,null,"d.  ","Exclude all packaging costs from reported price.   . . . . . . . . . . . . . . . . . . . . . . . . . . . . . . ."]
[]
[null,null,"e.  ","Exclude all cheese with a moisture content greater than 37.7%.   . . . . . . . . . . . . . . . . ."]
[null,"2.  If any of the above are checked “No” or \"N/A\", please explain:"]

{"sheet":"Page 4 of 8","index":3,"n_rows":39,"n_cols":8,"rows_kept":39,"cut":false,"hidden":false,"merged":[[5,2,5,4],[42,1,42,6],[1,1,1,3],[1,6,4,6],[2,1,2,3],[2,5,3,5],[2,7,3,8],[3,2,3,4],[4,2,4,4]]}
[]
[null,"Section 2 – Butter Sales",null,null,null,null,"Responsible reporting party understands and is currently reporting or can report based on each specification listed below"]
[null,"1. The following are the specifications for reporting weekly Butter sales data to AMS."]
[null,null,"Please review with the responsible reporting party and verify: "]
[null,null,"-Current Reporting Plants/Companies understand and are reporting based on each specification listed below. Discuss and answer any questions. "]
[null,null,"-Potential Reporting Plants/Companies understand and can report based on each specification listed below. Discuss and answer any questions. ",null,null,null,"N/A = Not Applicable - the specification does not apply to the plant/company (i.e. No organic production)"]
[null,null,null,null,null,null,"Yes          No           N/A   "]
[null,null,"a.    ","Report only salted butter with butterfat of 80% in 25 kilogram"]
[null,null,null,"and 68 pound boxes.  . . . . . . . . . . . . . . . . . . . . . . . . . . . . . . . . . . . . . . . . . . . . . . . . . . . . . .",null,null,null,{"$f":"'[1]Data Collections'!M67","v":""}]
[null,null,"b.  ","Report all fresh or storage butter sales meeting the other reporting"]
[null,null,null,"specifications.    . . . . . . . . . . . . . . . . . . . . . . . . . . . . . . . . . . . . . . . . . . . . . . . . . . . . . . . . . . .",null,null," ",{"$f":"'[1]Data Collections'!M68","v":""}]
[null,null,"c.  ","Report only butter meeting USDA Grade AA standards.    . . . . . . . . . . . . . . . . . . . . . . . . .",null,null,null,{"$f":"'[1]Data Collections'!M69","v":""}]
[null,null,"d.  ","Report price as f.o.b. plant if the product is “shipped out” from"]
[null,null,null,"a plant.  . . . . . . . . . . . . . . . . . . . . . . . . . . . . . . . . . . . . . . . . . . . . . . . . . . . . . . . . . . . . . . . . .",null,null,null,{"$f":"'[1]Data Collections'!M70","v":""}]
[null,null,"e.  ","Report price as f.o.b. storage  facility  if the product is “shipped out”"]
[null,null,null,"from the storage  facility.   .  . . . . . . . . . . . . . . . . . . . . . . . . . . . . . . . . . . . . . . . . . . . . . . . .",null,null,null,{"$f":"'[1]Data Collections'!M71","v":""}]
[null,null,"f. ","Report only complete transactions, i.e. butter is “shipped out”"]
[null,null,null,"and title transfer  occurs.   . . . . . . . . . . . . . . . . . . . . . . . . . . . . . . . . . . . . . . . . . . . . . . . . . .",null,null,null,{"$f":"'[1]Data Collections'!M72","v":""}]
[null,null,"g.  ","Report prices without deduction for brokerage fees paid by"]
[null,null,null,"the manufacturer.   . . . . . . . . . . . . . . . . . . . . . . . . . . . . . . . . . . . . . . . . . . . .  . . . . . . . . . . . .",null,null,null,{"$f":"'[1]Data Collections'!M73","v":""}]
[null,null,"h.  ","Report prices without deduction for clearing charges paid by"]
[null,null,null,"the manufacturer.   . . . . . . . . . . . . . . . . . . . . . . . . . . . . . . . . . . . . . . . . . . . . . . . . . . . . . . . .",null,null,null,{"$f":"'[1]Data Collections'!M74","v":""}]
[null,null,"i.","Include  sales of products labeled or contracted as sourced from"]
[null,null,null,"cows not treated with recombinant bovine somatotropin (rBST).   . . . . . . . . . . . . . . . . .",null,null,null,{"$f":"'[1]Data Collections'!M76","v":""}]
[null,null,"j.","Exclude forward pricing sales: sales in which the selling price is established"]
[null,null,null,"(and not adjusted) 30 or more days before the transaction is completed.   . . . . . . . . . . . .",null,null,null,{"$f":"'[1]Data Collections'!M77","v":""}]
[null,null,"k.","Exclude intra-company sales of butter.   . . . . . . . . . . . . . . . . . . . . . . . . . . . . . . . . . . . . . .",null,null,null,{"$f":"'[1]Data Collections'!M78","v":""}]
[null,null,"l.","Exclude re-sales of purchased butter.   . . . . . . . . . . . . . . . . . . . . . . . . . . . . . . . . . . . . . . . . ",null,null,null,{"$f":"'[1]Data Collections'!M79","v":""}]
[null,null,"m.","Exclude butter certified as organic by a USDA-accredited"]
[null,null,null,"certifying agent.  . . . . . . . . . . . . . . . . . . . . . . . . . . . . . . . . . . . . . . . . . . . . . . . . . . . . . . . . . .",null,null,null,{"$f":"'[1]Data Collections'!M80","v":""}]
[null,null,"n.","Exclude sales of butter produced under faith-based  close supervision and marketed"]
[null,null,null,"at a higher price than the manufacturer’s wholesale market price for the basic"]
[null,null,null,"commodity (for example, kosher butter produced with a rabbi on site who is actively  "]
[null,null,null,"involved in the supervision of the production process).   . . . . . . . . . . . . . . . . . . . . . . . . . . .",null,null,null,{"$f":"'[1]Data Collections'!M81","v":""}]
[null,null,"o.","Exclude sales of premium assisted sales (for example: export  assistance sales"]
[null,null,null,"through the Cooperatives Working Together (CWT) program).   . . . . . . . . . . . . . . . . . . . . .",null,null,null,{"$f":"'[1]Data Collections'!M82","v":""}]
[null,null,"p.","Exclude all sales of unsalted  butter.  . . . . . . . . . . . . . . . . . . . . . . . . . . . . . . . . . . . . . . . . .",null,null,null,{"$f":"'[1]Data Collections'!M83","v":""}]
[null,null,"q.","Exclude all sales of Grade A butter.   . . . . . . . . . . . . . . . . . . . . . . . . . . . . . . . . . . . . . . . . . .",null,null,null,{"$f":"'[1]Data Collections'!M84","v":""}]
[null,"2.   If any of the above are checked “No” or \"N/A\", please explain:"]

{"sheet":"Page 5 of 8","index":4,"n_rows":45,"n_cols":8,"rows_kept":45,"cut":false,"hidden":false,"merged":[[5,2,5,4],[47,1,47,6],[1,1,1,3],[1,5,4,5],[1,6,4,6],[2,7,3,8],[3,2,3,4],[4,2,4,4]]}
[]
[null,"Section 3 – Nonfat Dry Milk Sales",null,null,null,null,"Responsible reporting party understands and is currently reporting or can report based on each specification listed below"]
[null,"1. The following are the specifications for reporting weekly Nonfat Dry Milk sales data to"]
[null,null,"AMS.  Please review with the responsible reporting party and verify: "]
[null,null,"-Current Reporting Plants/Companies understand and are reporting based on each specification listed below. Discuss and answer any questions. "]
[null,null,"-Potential Reporting Plants/Companies understand and can report based on each specification listed below. Discuss and answer any questions. ",null,null,null,"N/A = Not Applicable - the specification does not apply to the plant/company (i.e. No organic production)"]
[null,null,null,null,null,null,"Yes          No           N/A   "]
[null,null,"a.   ","Report only non-fortified, nonfat dry milk in 25 kilogram bags,"]
[null,null,null,"50 pound bags, totes,  and tankers.   . . . . . . . . . . . . . . . . . . . . . . . . . . . . . . . . . . . . . . . . . .",null,null," ",{"$f":"'[1]Data Collections'!M94","v":""}]
[null,null,"b.  ","Report only nonfat dry milk meeting USDA Extra Grade or USPH Grade A standards.   . . . . . ",null,null," ",{"$f":"'[1]Data Collections'!M95","v":""}]
[]
[null,null,"c.  ","Report price as f.o.b. plant  if the product is “shipped out” from a plant.   . . . . . . . . . . . . .",null,null," ",{"$f":"'[1]Data Collections'!M96","v":""}]
[null,null,"d.  ","Report price as f.o.b. storage facility if the product is “shipped out” from the ",null,null,null,{"$f":"'[1]Data Collections'!M97","v":""}]
[null,null,null,"storage  facility.   . . . . . . . . . . . . . . . . . . . . . . . . . . . . . . . . . . . . . . . . . . . . . . . . . . . . . . . . ."]
[]
[null,null,"e.  ","Report only complete transactions, i.e. nonfat dry milk is “shipped"]
[null,null,null,"out” and title transfer  occurs.   . . . . . . . . . . . . . . . . . . . . . . . . . . . . . . . . . . . . . . . . . . . . . .",null,null,null,{"$f":"'[1]Data Collections'!M98","v":""}]
[null,null,"f.  ","Report only nonfat dry milk manufactured using low or medium heat process.   . . . . . . . . ",null,null," ",{"$f":"'[1]Data Collections'!M99","v":""}]
[]
[null,null,"g.  ","Report prices without deduction for brokerage fees paid by the manufacturer.   . . . . . . . .",null,null," ",{"$f":"'[1]Data Collections'!M100","v":""}]
[null,null,"h.  ","Report prices without deduction for clearing charges paid by the manufacturer.   . . . . . . .",null,null," ",{"$f":"'[1]Data Collections'!M101","v":""}]
[null,null,null,null,null,null," "]
[null,null,"i.  ","Include  sales of products labeled or contracted as sourced from",null,null," "]
[null,null,null,"cows not treated with recombinant bovine somatotropin (rBST).   . . . . . . . . . . . . . . . . .",null,null," ",{"$f":"'[1]Data Collections'!M103","v":""}]
[null,null,"j.","Exclude forward pricing sales: sales in which the selling price is established",null,null," "]
[null,null,null,"(and not adjusted) 30 or more days before the transaction is completed.   . . . . . . . . . . . .",null,null," ",{"$f":"'[1]Data Collections'!M104","v":""}]
[]
[null,null,"k.","Exclude intra-company sales of nonfat dry milk.   . . . . . . . . . . . . . . . . . . . . . . . . . . . . . . . .",null,null," ",{"$f":"'[1]Data Collections'!M105","v":""}]
[null,null,"l.","Exclude re-sales of purchased nonfat dry milk.   . . . . . . . . . . . . . . . . . . . . . . . . . . . . . . . . .",null,null," ",{"$f":"'[1]Data Collections'!M106","v":""}]
[null,null,null,null,null,null," "]
[null,null,"m.","Exclude nonfat dry milk certified as organic by a USDA-accredited certifying agent.   . . . .",null,null," ",{"$f":"'[1]Data Collections'!M107","v":""}]
[null,null,"n.","Exclude sales of nonfat dry milk produced  under faith-based  close supervision and "]
[null,null,null,"marketed at a higher price than the manufacturer’s wholesale market price for the",null,null," "]
[null,null,null,"basic commodity (for example, kosher nonfat dry milk produced with a rabbi on site",null,null," "]
[null,null,null,"who is actively involved in the supervision of the production process).   . . . . . . . . . . . . . . . . . . . .",null,null," ",{"$f":"'[1]Data Collections'!M108","v":""}]
[]
[null,null,"o.","Exclude all sales of nonfat dry milk using  high  heat  process.   . . . . . . . . . . . . . . . . . . . . .",null,null," ",{"$f":"'[1]Data Collections'!M109","v":""}]
[null,null,"p.","Exclude sales of premium assisted sales (for example: export  assistance sales",null,null," "]
[null,null,null,"through the Cooperatives Working Together (CWT) program).   . . . . . . . . . . . . . . . . . . . . .",null,null," ",{"$f":"'[1]Data Collections'!M110","v":""}]
[null,null,null,null,null,null," "]
[null,null,"q.","Exclude all sales of nonfat dry milk more than 180 days  old.   . . . . . . . . . . . . . . . . . . . . . .",null,null," ",{"$f":"'[1]Data Collections'!M111","v":""}]
[null,null,"r.","Exclude all sales of instant nonfat dry milk.   . . . . . . . . . . . . . . . . . . . . . . . . . . . . . . . . . . . .",null,null," ",{"$f":"'[1]Data Collections'!M112","v":""}]
[null,null,null,null,null,null," "]
[null,null,"s.","Exclude all sales of dry buttermilk products.   . . . . . . . . . . . . . . . . . . . . . . . . . . . . . . . . . . .",null,null," ",{"$f":"'[1]Data Collections'!M113","v":""}]
[null,"2.   If any of the above are checked “No” or \"N/A\", please explain:"]

{"sheet":"Page 6 of 8","index":5,"n_rows":38,"n_cols":8,"rows_kept":38,"cut":false,"hidden":false,"merged":[[41,1,41,6],[1,1,1,3],[1,6,4,6],[2,7,3,8],[3,2,3,4],[4,2,4,4],[5,2,5,4]]}
[]
[null,"Section 4 – Dry Whey Sales",null,null,null,null,"Responsible reporting party understands and is currently reporting or can report based on each specification listed below"]
[null,"1. The following are the specifications for reporting weekly Dry Whey sales data to"]
[null,null,"AMS.  Please review with the responsible reporting party and verify: "]
[null,null,"-Current Reporting Plants/Companies understand and are reporting based on each specification listed below. Discuss and answer any questions. "]
[null,null,"-Potential Reporting Plants/Companies understand and can report based on each specification listed below. Discuss and answer any questions. ",null,null,null,"N/A = Not Applicable - the specification does not apply to the plant/company (i.e. No organic production)"]
[null,null,null,null,null,null,"Yes          No           N/A   "]
[null,null,"a.   ","Report only edible non-hygroscopic dry whey in 25 kilogram"]
[null,null,null,"bags, 50 pound bags, totes,  and tankers.  . . . . . . . . . . . . . . . . . . . . . . . . . . . . . . . . . . . . .",null,null,null,{"$f":"'[1]Data Collections'!M123","v":""}]
[null,null,"b.  ","Report only dry whey meeting USDA Extra Grade standards.    . . . . . . . . . . . . . . . . . . . . .",null,null,null,{"$f":"'[1]Data Collections'!M124","v":""}]
[]
[null,null,"c.  ","Report price as f.o.b. plant  if the product is “shipped out” from a plant.   . . . . . . . . . . . . ",null,null,null,{"$f":"'[1]Data Collections'!M125","v":""}]
[null,null,"d.  ","Report price as f.o.b. storage facility if the product is “shipped"]
[null,null,null,"out” from the storage  facility.   . . . . . . . . . . . . . . . . . . . . . . . . . . . . . . . . . . . . . . . . . . . . . .",null,null,null,{"$f":"'[1]Data Collections'!M126","v":""}]
[null,null,"e.  ","Report only complete transactions, i.e. dry whey is “shipped out”"]
[null,null,null,"and title transfer  occurs.   . . . . . . . . . . . . . . . . . . . . . . . . . . . . . . . . . . . . . . . . . . . . . . . . . . ",null,null,null,{"$f":"'[1]Data Collections'!M127","v":""}]
[null,null,"f.  ","Report prices without deduction for brokerage fees paid by the manufacturer.   . . . . . . .",null,null,null,{"$f":"'[1]Data Collections'!M128","v":""}]
[]
[null,null,"g.  ","Report prices without deduction for clearing charges paid by the manufacturer.   . . . . . .",null,null,null,{"$f":"'[1]Data Collections'!M129","v":""}]
[null,null,"h.  ","Include  sales of products labeled or contracted as sourced from"]
[null,null,null,"cows not treated with recombinant bovine somatotropin (rBST).    . . . . . . . . . . . . . . . .",null,null,null,{"$f":"'[1]Data Collections'!M130","v":""}]
[null,null,"i.  ","Exclude forward pricing sales: sales in which the selling price is established"]
[null,null,null,"(and not adjusted) 30 or more days before the transaction is completed.   . . . . . . . . . . . .",null,null,null,{"$f":"'[1]Data Collections'!M131","v":""}]
[null,null,"j.  ","Exclude intra-company sales of dry whey.   . . . . . . . . . . . . . . . . . . . . . . . . . . . . . . . . . . . . ",null,null,null,{"$f":"'[1]Data Collections'!M132","v":""}]
[]
[null,null,"k.  ","Exclude re-sales of purchased dry whey.    . . . . . . . . . . . . . . . . . . . . . . . . . . . . . . . . . . . . . .",null,null,null,{"$f":"'[1]Data Collections'!M133","v":""}]
[null,null,"l.   ","Exclude dry whey certified as organic by a USDA-accredited certifying agent.   . . . . . . . . ",null,null,null,{"$f":"'[1]Data Collections'!M134","v":""}]
[]
[null,null,"m.  ","Exclude sales of dry whey produced under faith-based  close supervision and "]
[null,null,null,"marketed at a higher price than the manufacturer’s wholesale market price for the"]
[null,null,null,"basic commodity  (for example, kosher dry whey produced with a rabbi on site who is"]
[null,null,null,"actively involved in the supervision of the production process).    . . . . . . . . . . . . . . . . . . .",null,null,null,{"$f":"'[1]Data Collections'!M135","v":""}]
[null,null,"n.  ","Exclude premium assisted sales (for example: seller receives additional monetary"]
[null,null,null,"value above sale price from a third party (i.e. government or private entity) for the"]
[null,null,null,"export of dairy products based on criteria defined by the third party).   . . . . . . . . . . . . . . .",null,null,null,{"$f":"'[1]Data Collections'!M136","v":""}]
[null,null,"o.  ","Exclude all sales of dry whey more than 180 days  old.   . . . . . . . . . . . . . . . . . . . . . . . . . .",null,null,null,{"$f":"'[1]Data Collections'!M137","v":""}]
[null,null,"p.  ","Exclude all Grade A dry whey.    . . . . . . . . . . . . . . . . . . . . . . . . . . . . . . . . . . . . . . . . . . . . . .",null,null,null,{"$f":"'[1]Data Collections'!M138","v":""}]
[null,"2. If any of the above are checked “No” or \"N/A\", please explain:"]

{"sheet":"Page 7 of 8","index":6,"n_rows":43,"n_cols":11,"rows_kept":43,"cut":false,"hidden":false,"merged":[[42,2,42,4],[42,5,42,6],[42,8,42,9],[35,4,35,6],[35,8,35,9],[37,2,37,4],[37,5,37,6],[37,8,37,9],[40,4,40,6],[40,8,40,9],[33,5,33,6],[7,4,7,6],[7,7,7,8],[11,3,11,9],[14,3,14,8],[15,3,15,8],[16,3,16,8],[27,1,27,10],[30,4,30,6],[30,8,30,9],[32,5,32,6],[32,8,32,9],[4,4,4,6],[4,7,4,8],[5,4,5,6],[5,7,5,8],[6,4,6,6],[6,7,6,8]]}
[]
[null,"Section 5 – Other Information",null,null,null,null,null,null,null,"Yes     ","  No"]
[null,"1.  Does another plant/company report any Dairy Product Sales data for this plant/company?"]
[null,null,"a. ","If yes, who and what products? [Interviewer Note: If no, skip to Question 2]. . . . . . . . . . . . . . . . . . . . . . . . . . . . . . . . . . . . .",null,null,null,null,null," "]
[null,null,null,null,"Plant Name",null,null,"Reported Product"]
[]
[]
[]
[]
[null,null,"b.   ","If yes, does this plant/company have production sales not included in data submitted through your reporting "]
[null,null,null,"plant/company (i.e. cheese is reported through another plant/company but your plant/company also makes"]
[null,null,null,"and sells dry whey OR your plant/company has additional cheese cash sales outside the information reported"]
[null,null,null,"by the plant/company listed)?. . . . . . . . . . . . . . . . . . . . . . . . . . . . . . . . . . . . . . . . . . . . . . . . . . . . . . . . . . . . . . . . . . . . . . . . . . . .",null,null,null,null,null," "]
[null,null,null,"If yes, what products?  [Interviewer Note: If no, skip to Question 2]"]
[]
[]
[]
[]
[null,"2.  Does this plant/company make day-to-day marketing decisions and report (or can report) for more than one plant?"]
[null,null,"If yes, please identify all plants in the Multiple Plant List (page 8) to be included in the reporting of this "]
[null,null,"plant's/company's information before continuing to Question 3. If no, and there are plants listed on the "]
[null,null,"completed Supplement that are or should be reporting, please list the Plant ID (or office use if plant is "]
[null,null,"new,i.e., P1, P2) for these plants.  . . . . . . . . . . . . . . . . . . . . . . . . . . . . . . . . . . . . . . . . . . . . . . . . . . . . . . . . . .",null,null,null,null,null,null," "]
[]
[]
[]
[]
[null,"Interviewer Note: If plant/company qualifies, inform respondents of the weekly responsibilities and collect contact information."]
[]
[null,"3.  Primary contact at this plant/company for completing the Dairy Product Sales Surveys?"]
[null,null,"Name:",null,null,null,null,"Position:  "]
[]
[null,null,"Telephone:",null,null,null,null,"Email: "]
[null,"                                                                                      "]
[null,"    Secondary contact at this plant/company for completing the Dairy Product Sales Survey?"]
[null,null,"Name:",null,null,null,null,"Position:  "]
[]
[null,null,"Telephone:",null,null,null,null,"Email: "]
[]
[null,"    Additional contact at this plant/company for completing the Dairy Product Sales Survey?"]
[null,null,"Name:",null,null,null,null,"Position:  "]
[]
[null,null,"Telephone:",null,null,null,null,"Email: "]

{"sheet":"Page 8 of 8","index":7,"n_rows":58,"n_cols":25,"rows_kept":58,"cut":false,"hidden":false,"merged":[[26,18,26,20],[26,21,26,22],[30,21,30,22],[47,19,47,21],[27,18,27,20],[27,21,27,22],[28,18,28,20],[28,21,28,22],[29,18,29,20],[29,21,29,22],[34,21,34,22],[35,18,35,20],[37,21,37,22],[36,18,36,20],[36,21,36,22],[37,18,37,20],[33,18,33,20],[32,21,32,22],[33,21,33,22],[32,18,32,20],[30,18,30,20],[43,21,43,22],[6,18,6,20],[6,21,6,22],[7,18,7,20],[7,21,7,22],[8,18,8,20],[8,21,8,22],[23,13,25,17],[3,18,4,20],[3,21,4,22],[5,13,7,17],[5,18,5,20],[5,21,5,22],[8,13,10,17],[9,18,9,20],[9,21,9,22],[10,18,10,20],[10,21,10,22],[11,18,11,20],[11,21,11,22],[18,18,18,20],[18,21,18,22],[23,21,23,22],[19,18,19,20],[17,21,17,22],[55,6,55,10],[47,2,47,17],[54,6,54,22],[35,2,37,3],[35,4,37,7],[29,8,31,12],[32,8,34,12],[35,8,37,12],[32,2,34,3],[32,4,34,7],[38,13,40,17],[38,18,38,20],[38,21,38,22],[39,18,39,20],[39,21,39,22],[40,18,40,20],[40,21,40,22],[41,13,43,17],[41,18,41,20],[41,21,41,22],[42,18,42,20],[42,21,42,22],[43,18,43,20],[20,13,22,17],[23,2,25,3],[23,4,25,7],[14,2,16,3],[14,4,16,7],[12,21,12,22],[13,18,13,20],[13,21,13,22],[14,18,14,20],[14,21,14,22],[20,18,20,20],[20,21,20,22],[25,21,25,22],[21,18,21,20],[21,21,21,22],[22,18,22,20],[22,21,22,22],[23,18,23,20],[19,21,19,22],[15,18,15,20],[15,21,15,22],[16,18,16,20],[16,21,16,22],[17,18,17,20],[3,2,3,7],[5,4,7,7],[8,2,10,3],[8,4,10,7],[11,2,13,3],[11,4,13,7],[17,2,19,3],[17,4,19,7],[20,2,22,3],[20,4,22,7],[4,4,4,7],[25,18,25,20],[31,21,31,22],[31,18,31,20],[5,2,7,3],[4,2,4,3],[11,8,13,12],[14,8,16,12],[57,3,57,10],[55,11,55,12],[5,8,7,12],[8,8,10,12],[38,2,40,3],[38,4,40,7],[38,8,40,12],[41,2,43,3],[41,4,43,7],[41,8,43,12],[26,13,28,17],[29,13,31,17],[32,13,34,17],[23,8,25,12],[11,13,13,17],[14,13,16,17],[17,13,19,17],[4,8,4,12],[4,13,4,17],[3,8,3,12],[56,13,56,18],[55,13,55,17],[57,13,57,17],[57,11,57,12],[54,2,54,5],[53,2,53,5],[12,18,12,20],[26,2,28,3],[26,4,28,7],[29,2,31,3],[29,4,31,7],[35,13,37,17],[53,20,53,22],[53,6,53,17],[17,8,19,12],[20,8,22,12],[35,21,35,22],[34,18,34,20],[26,8,28,12],[24,18,24,20],[24,21,24,22]]}
[]
[null,null,"Multiple Plants List Table:  [Interviewer Note: List Plant Name, Location, and Dairy Products "]
[null,null,"reported for all company locations currently included in submitting a weekly report.]"]
[null,null,"Office Use",null,null,null,null,null,{"$f":"IF('Page 8 of 8 (2)'!E6=\"\",\"\",\"Print Page 8 of 8(2)\")","v":""},null,null,null,null,null,null,null,null,null,"Products\nReported",null,null,"Report\nType"]
[null,null,"Reporting\nID",null,"Plant\nID",null,null,null,"Plant Name",null,null,null,null,"Location"]
[]
[]
[]
[]
[]
[]
[]
[]
[]
[]
[]
[]
[]
[]
[]
[]
[]
[]
[]
[]
[]
[]
[]
[]
[]
[]
[]
[]
[]
[]
[]
[]
[]
[]
[]
[]
[]
[]
[]
[null,"4.  Do you understand the instructions and requirements of the Dairy Product Mandatory",null,null,null,null,null,null,null,null,null,null,null,null,null,null,null,null,null,null,"   Yes",null,"No"]
[null,null,"Reporting Program?  . . . . . . . . . . . . . . . . . . . . . . . . . . . . . . . . . . . . . . . . . . . . . . . . . . . . . . . . . . . . . . . . . . . . . . . . . . . . . . . . . . . . . . . .",null,null,null,null,null,null,null,null,null,null,null,null,null,null,null,null,null," ",null,null,null,{"$f":"'Data Collections'!D166","v":""}]
[null,"5.  Do you need any additional explanation of any definition, question, or issues discussed in the Annual"]
[null,null,"Validation Worksheet?"]
[null,null,"If yes, review  all sections the respondent would like additional clarification.. . . . . . . . . . . . . . . . . . . . . . . . . . . . . . . . . ",null,null,null,null,null,null,null,null,null,null,null,null,null,null,null,null,null," ",null,null,null,{"$f":"'Data Collections'!D167","v":""}]
[null,null,"General Survey Comments: (Text Box Note- If you want to press enter to start a new line you need to press either CTRL+ENTER or SHIFT+ENTER)"]
[]
[]
[]
[null,null,"Interviewer Name:"]
[]
[null,null,"Respondent Name:",null,null,null,null,null,null,null,null,"Telephone:"]
[]
[null,null,"Signature:",null,null,null,null,null,null,null,null,"Date:"]

{"sheet":"Data Collections","index":8,"n_rows":171,"n_cols":13,"rows_kept":171,"cut":false,"hidden":true,"merged":[[99,12,99,14],[100,12,100,14],[90,6,90,14],[91,6,91,14],[93,12,93,14],[94,12,94,14],[95,12,95,14],[106,12,106,14],[107,12,107,14],[83,12,83,14],[76,12,76,14],[67,12,67,14],[82,12,82,14],[80,12,80,14],[81,12,81,14],[96,12,96,14],[97,12,97,14],[98,12,98,14],[153,0,153,4],[14,0,14,5],[36,0,36,4],[47,0,47,4],[59,0,59,4],[86,0,86,4],[115,0,115,4],[140,0,140,4],[147,0,147,4],[150,0,150,4],[91,2,91,3],[91,4,91,5],[64,2,64,3],[64,4,64,5],[90,2,90,3],[90,4,90,5],[63,2,63,3],[63,4,63,5],[119,2,119,3],[119,4,119,5],[120,2,120,3],[120,4,120,5],[170,0,170,11],[3,0,3,1],[4,0,4,1],[5,0,5,1],[18,2,18,3],[18,4,18,5],[19,2,19,3],[19,4,19,5],[49,2,49,3],[49,4,49,5],[50,2,50,3],[50,4,50,5],[40,2,40,3],[40,4,40,5],[41,2,41,3],[41,4,41,5],[40,6,40,14],[41,6,41,14],[86,12,86,14],[123,12,123,14],[124,12,124,14],[125,12,125,14],[126,12,126,14],[127,12,127,14],[135,12,135,14],[136,12,136,14],[137,12,137,14],[34,12,34,14],[18,6,18,14],[19,6,19,14],[29,12,29,14],[30,12,30,14],[31,12,31,14],[32,12,32,14],[33,12,33,14],[24,12,24,14],[25,12,25,14],[26,12,26,14],[27,12,27,14],[28,12,28,14],[21,12,21,14],[22,12,22,14],[23,12,23,14],[42,12,42,14],[43,12,43,14],[44,12,44,14],[45,12,45,14],[51,12,51,14],[49,6,49,14],[50,6,50,14],[52,12,52,14],[53,12,53,14],[54,12,54,14],[55,12,55,14],[77,12,77,14],[78,12,78,14],[79,12,79,14],[72,12,72,14],[73,12,73,14],[74,12,74,14],[75,12,75,14],[63,6,63,14],[64,6,64,14],[66,12,66,14],[68,12,68,14],[69,12,69,14],[70,12,70,14],[71,12,71,14],[110,12,110,14],[101,12,101,14],[102,12,102,14],[103,12,103,14],[104,12,104,14],[105,12,105,14],[111,12,111,14],[112,12,112,14],[119,6,119,14],[108,12,108,14],[109,12,109,14],[120,6,120,14],[122,12,122,14],[133,12,133,14],[134,12,134,14],[128,12,128,14],[129,12,129,14],[130,12,130,14],[131,12,131,14],[132,12,132,14]]}
["Page 1"]
[]
["Office Use "]
["Current Reporter",null,false,false,false,false,false,false,false,false,false,false,false]
["Potential DPP Reporter",null,false,false,false,false,false,false,false,false,false,false,false]
["Other Specifications",null,false,false,false,false,false,false,false,false,false,false,false]
[null,"Yes ","No"]
[1,false,false,{"$f":"IF(AND('Data Collections'!B8=TRUE,'Data Collections'!C8=TRUE),\"Check Only One Box\",\"\")","v":""}]
["2a",false,false,{"$f":"IF(AND('Data Collections'!B9=TRUE,'Data Collections'!C9=TRUE),\"Check Only One Box\",\"\")","v":""}]
["2b",false,false,{"$f":"IF(AND('Data Collections'!B10=TRUE,'Data Collections'!C10=TRUE),\"Check Only One Box\",\"\")","v":""}]
["2c",false,false,{"$f":"IF(AND('Data Collections'!B11=TRUE,'Data Collections'!C11=TRUE),\"Check Only One Box\",\"\")","v":""}]
["2d",false,false,{"$f":"IF(AND('Data Collections'!B12=TRUE,'Data Collections'!C12=TRUE),\"Check Only One Box\",\"\")","v":""}]
["2e",false,false,{"$f":"IF(AND('Data Collections'!B13=TRUE,'Data Collections'!C13=TRUE),\"Check Only One Box\",\"\")","v":""}]
[3]
[]
[]
["Page 2"]
[]
[null,null,"Current Reporter",null,"New Reporter",null,"This section checks to make sure only one box is checked"]
[null,null,false,null,false,null,{"$f":"IF(AND('Data Collections'!C20=TRUE,'Data Collections'!E20=TRUE),\"Check Only One Box\",\"\")","v":""}]
[1,"NA","yes","no","yes","no"]
["1a",false,false,false,false,false,{"$f":"IF(B22=TRUE,1,\"\")","v":""},{"$f":"IF(C22=TRUE,1,\"\")","v":""},"","","",{"$f":"IF(SUM(G22:K22)=\"\",\"\",SUM(G22:K22))","v":0},{"$f":"IF(AND(G22=1,SUM(H22:K22)>0),\"Too many check marks!\",IF(AND(G22=\"\",H22=\"\",I22=1,J22=\"\",K22=\"\"),\"Check YES or NO under New Reporter.\",IF(AND(G22=\"\",H22=\"\",I22=1,J22=1,K22=1),\"Check only ONE box under New Reporter.\",IF(AND(I22=\"\",L22>1),\"Too many check marks!\",IF(AND(H22=1,I22=1),\"Too many Checkmarks!\",\"\")))))","v":""}]
["1b",false,false,false,false,false,{"$f":"IF(B23=TRUE,1,\"\")","v":""},{"$f":"IF(C23=TRUE,1,\"\")","v":""},{"$f":"IF(D23=TRUE,1,\"\")","v":""},{"$f":"IF(E23=TRUE,1,\"\")","v":""},{"$f":"IF(F23=TRUE,1,\"\")","v":""},0,{"$f":"IF(AND(G23=1,SUM(H23:K23)>0),\"Too many check marks!\",IF(AND(G23=\"\",H23=\"\",I23=1,J23=\"\",K23=\"\"),\"Check YES or NO under New Reporter.\",IF(AND(G23=\"\",H23=\"\",I23=1,J23=1,K23=1),\"Check only ONE box under New Reporter.\",IF(AND(I23=\"\",L23>1),\"Too many check marks!\",IF(AND(H23=1,I23=1),\"Too many Checkmarks!\",\"\")))))","v":""}]
["1c",false,false,false,false,false,"","","","","",0,""]
["1d",false,false,false,false,false,"","","","","",0,""]
["1e",false,false,false,false,false,"","","","","",0,""]
["1f",false,false,false,false,false,"","","","","",0,""]
["1g",false,false,false,false,false,"","","","","",0,""]
["1h",false,false,false,false,false,"","","","","",0,""]
["1i",false,false,false,false,false,"","","","","",0,""]
["1j",false,false,false,false,false,"","","","","",0,""]
["1k",false,false,false,false,false,"","","","","",0,""]
["1l",false,false,false,false,false,"","","","","",0,""]
["1m",false,false,false,false,false,"","","","","",0,""]
["1n",false,false,false,false,false,"","","","","",0,{"$f":"IF(AND(G35=1,SUM(H35:K35)>0),\"Too many check marks!\",IF(AND(G35=\"\",H35=\"\",I35=1,J35=\"\",K35=\"\"),\"Check YES or NO under New Reporter.\",IF(AND(G35=\"\",H35=\"\",I35=1,J35=1,K35=1),\"Check only ONE box under New Reporter.\",IF(AND(I35=\"\",L35>1),\"Too many check marks!\",IF(AND(H35=1,I35=1),\"Too many Checkmarks!\",\"\")))))","v":""}]
[2]
[""]
[]
["Page 3"]
[]
["Section 1b",null,"Current Reporter",null,"New Reporter",null,"This section checks to make sure only one box is checked"]
[null,null,false,null,false,null,{"$f":"IF(AND('Data Collections'!C42=TRUE,'Data Collections'!E42=TRUE),\"Check Only One Box\",\"\")","v":""}]
["1a",false,false,false,false,false,{"$f":"IF(B43=TRUE,1,\"\")","v":""},{"$f":"IF(C43=TRUE,1,\"\")","v":""},{"$f":"IF(D43=TRUE,1,\"\")","v":""},{"$f":"IF(E43=TRUE,1,\"\")","v":""},{"$f":"IF(F43=TRUE,1,\"\")","v":""},{"$f":"IF(SUM(G43:K43)=\"\",\"\",SUM(G43:K43))","v":0},{"$f":"IF(AND(G43=1,SUM(H43:K43)>0),\"Too many check marks!\",IF(AND(G43=\"\",H43=\"\",I43=1,J43=\"\",K43=\"\"),\"Check YES or NO under New Reporter.\",IF(AND(G43=\"\",H43=\"\",I43=1,J43=1,K43=1),\"Check only ONE box under New Reporter.\",IF(AND(I43=\"\",L43>1),\"Too many check marks!\",IF(AND(H43=1,I43=1),\"Too many Checkmarks!\",\"\")))))","v":""}]
["1b",false,false,false,false,false,{"$f":"IF(B44=TRUE,1,\"\")","v":""},"","","","",0,""]
["1c",false,false,false,false,false,"","","","","",0,""]
["1d",false,false,false,false,false,"","","","","",0,""]
[2]
[""]
[]
["Section 1c",null,"Current Reporter",null,"New Reporter",null,"This section checks to make sure only one box is checked"]
[null,null,false,null,false,null,{"$f":"IF(AND('Data Collections'!C51=TRUE,'Data Collections'!E51=TRUE),\"Check Only One Box\",\"\")","v":""}]
["1a",false,false,false,false,false,{"$f":"IF(B52=TRUE,1,\"\")","v":""},{"$f":"IF(C52=TRUE,1,\"\")","v":""},{"$f":"IF(D52=TRUE,1,\"\")","v":""},{"$f":"IF(E52=TRUE,1,\"\")","v":""},{"$f":"IF(F52=TRUE,1,\"\")","v":""},{"$f":"IF(SUM(G52:K52)=\"\",\"\",SUM(G52:K52))","v":0},{"$f":"IF(AND(G52=1,SUM(H52:K52)>0),\"Too many check marks!\",IF(AND(G52=\"\",H52=\"\",I52=1,J52=\"\",K52=\"\"),\"Check YES or NO under New Reporter.\",IF(AND(G52=\"\",H52=\"\",I52=1,J52=1,K52=1),\"Check only ONE box under New Reporter.\",IF(AND(I52=\"\",L52>1),\"Too many check marks!\",IF(AND(H52=1,I52=1),\"Too many Checkmarks!\",\"\")))))","v":""}]
["1b",false,false,false,false,false,{"$f":"IF(B53=TRUE,1,\"\")","v":""},"","","","",0,""]
["1c",false,false,false,false,false,"","","","","",0,""]
["1d",false,false,false,false,false,"","","","","",0,""]
["1e",false,false,false,false,false,{"$f":"IF(B56=TRUE,1,\"\")","v":""},{"$f":"IF(C56=TRUE,1,\"\")","v":""},{"$f":"IF(D56=TRUE,1,\"\")","v":""},{"$f":"IF(E56=TRUE,1,\"\")","v":""},{"$f":"IF(F56=TRUE,1,\"\")","v":""},{"$f":"IF(SUM(G56:K56)=\"\",\"\",SUM(G56:K56))","v":0},""]
[]
[]
[2]
[""]
[]
["Page 4"]
[]
[null,null,"Current Reporter",null,"New Reporter",null,"This section checks to make sure only one box is checked"]
[null,null,false,null,false,null,{"$f":"IF(AND('Data Collections'!C65=TRUE,'Data Collections'!E65=TRUE),\"Check Only One Box\",\"\")","v":""}]
[1,"NA","yes","no","yes","no"]
["1a",false,false,false,false,false,{"$f":"IF(B67=TRUE,1,\"\")","v":""},{"$f":"IF(C67=TRUE,1,\"\")","v":""},{"$f":"IF(D67=TRUE,1,\"\")","v":""},{"$f":"IF(E67=TRUE,1,\"\")","v":""},{"$f":"IF(F67=TRUE,1,\"\")","v":""},{"$f":"IF(SUM(G67:K67)=\"\",\"\",SUM(G67:K67))","v":0},{"$f":"IF(AND(G67=1,SUM(H67:K67)>0),\"Too many check marks!\",IF(AND(G67=\"\",H67=\"\",I67=1,J67=\"\",K67=\"\"),\"Check YES or NO under New Reporter.\",IF(AND(G67=\"\",H67=\"\",I67=1,J67=1,K67=1),\"Check only ONE box under New Reporter.\",IF(AND(I67=\"\",L67>1),\"Too many check marks!\",IF(AND(H67=1,I67=1),\"Too many Checkmarks!\",\"\")))))","v":""}]
["1b",false,false,false,false,false,{"$f":"IF(B68=TRUE,1,\"\")","v":""},"","","","",0,""]
["1c",false,false,false,false,false,"","","","","",0,""]
["1d",false,false,false,false,false,"","","","","",0,""]
["1e",false,false,false,false,false,"","","","","",0,""]
["1f",false,false,false,false,false,"","","","","",0,""]
["1g",false,false,false,false,false,"","","","","",0,""]
["1h",false,false,false,false,false,"","","","","",0,""]
["1i",false,false,false,false,false,"","","","","",0,""]
["1j",false,false,false,false,false,"","","","","",0,""]
["1k",false,false,false,false,false,"","","","","",0,""]
["1l",false,false,false,false,false,"","","","","",0,""]
["1m",false,false,false,false,false,"","","","","",0,""]
["1n",false,false,false,false,false,"","","","","",0,""]
["1o",false,false,false,false,false,{"$f":"IF(B81=TRUE,1,\"\")","v":""},{"$f":"IF(C81=TRUE,1,\"\")","v":""},{"$f":"IF(D81=TRUE,1,\"\")","v":""},{"$f":"IF(E81=TRUE,1,\"\")","v":""},{"$f":"IF(F81=TRUE,1,\"\")","v":""},{"$f":"IF(SUM(G81:K81)=\"\",\"\",SUM(G81:K81))","v":0},""]
["1p",false,false,false,false,false,"","","","","",0,""]
["1q",false,false,false,false,false,"","","","","",0,""]
["1r",false,false,false,false,false,"","","","","",0,""]
[]
[2]
[""]
[]
["Page 5"]
[]
[null,null,"Current Reporter",null,"New Reporter",null,"This section checks to make sure only one box is checked"]
[null,null,false,null,false,null,{"$f":"IF(AND('Data Collections'!C92=TRUE,'Data Collections'!E92=TRUE),\"Check Only One Box\",\"\")","v":""}]
[1,"NA","yes","no","yes","no"]
["1a",false,false,false,false,false,{"$f":"IF(B94=TRUE,1,\"\")","v":""},{"$f":"IF(C94=TRUE,1,\"\")","v":""},{"$f":"IF(D94=TRUE,1,\"\")","v":""},{"$f":"IF(E94=TRUE,1,\"\")","v":""},{"$f":"IF(F94=TRUE,1,\"\")","v":""},{"$f":"IF(SUM(G94:K94)=\"\",\"\",SUM(G94:K94))","v":0},{"$f":"IF(AND(G94=1,SUM(H94:K94)>0),\"Too many check marks!\",IF(AND(G94=\"\",H94=\"\",I94=1,J94=\"\",K94=\"\"),\"Check YES or NO under New Reporter.\",IF(AND(G94=\"\",H94=\"\",I94=1,J94=1,K94=1),\"Check only ONE box under New Reporter.\",IF(AND(I94=\"\",L94>1),\"Too many check marks!\",IF(AND(H94=1,I94=1),\"Too many Checkmarks!\",\"\")))))","v":""}]
["1b",false,false,false,false,false,{"$f":"IF(B95=TRUE,1,\"\")","v":""},"","","","",0,""]
["1c",false,false,false,false,false,"","","","","",0,""]
["1d",false,false,false,false,false,"","","","","",0,""]
["1e",false,false,false,false,false,"","","","","",0,""]
["1f",false,false,false,false,false,"","","","","",0,""]
["1g",false,false,false,false,false,"","","","","",0,""]
["1h",false,false,false,false,false,"","","","","",0,""]
["1i",false,false,false,false,false,"","","","","",0,""]
["1j",false,false,false,false,false,"","","","","",0,""]
["1k",false,false,false,false,false,"","","","","",0,""]
["1l",false,false,false,false,false,"","","","","",0,""]
["1m",false,false,false,false,false,"","","","","",0,""]
["1n",false,false,false,false,false,"","","","","",0,""]
["1o",false,false,false,false,false,"","","","","",0,""]
["1p",false,false,false,false,false,"","","","","",0,""]
["1q",false,false,false,false,false,"","","","","",0,""]
["1r",false,false,false,false,false,"","","","","",0,""]
["1s",false,false,false,false,false,{"$f":"IF(B112=TRUE,1,\"\")","v":""},{"$f":"IF(C112=TRUE,1,\"\")","v":""},{"$f":"IF(D112=TRUE,1,\"\")","v":""},{"$f":"IF(E112=TRUE,1,\"\")","v":""},{"$f":"IF(F112=TRUE,1,\"\")","v":""},{"$f":"IF(SUM(G112:K112)=\"\",\"\",SUM(G112:K112))","v":0},""]
["1t",false,false,false,false,false,"","","","","",0,""]
[]
[2]
[""]
[]
["Page 6"]
[]
[null,null,"Current Reporter",null,"New Reporter",null,"This section checks to make sure only one box is checked"]
[null,null,false,null,false,null,{"$f":"IF(AND('Data Collections'!C121=TRUE,'Data Collections'!E121=TRUE),\"Check Only One Box\",\"\")","v":""}]
[1,"NA","yes","no","yes","no"]
["1a",false,false,false,false,false,{"$f":"IF(B123=TRUE,1,\"\")","v":""},{"$f":"IF(C123=TRUE,1,\"\")","v":""},{"$f":"IF(D123=TRUE,1,\"\")","v":""},{"$f":"IF(E123=TRUE,1,\"\")","v":""},{"$f":"IF(F123=TRUE,1,\"\")","v":""},{"$f":"IF(SUM(G123:K123)=\"\",\"\",SUM(G123:K123))","v":0},{"$f":"IF(AND(G123=1,SUM(H123:K123)>0),\"Too many check marks!\",IF(AND(G123=\"\",H123=\"\",I123=1,J123=\"\",K123=\"\"),\"Check YES or NO under New Reporter.\",IF(AND(G123=\"\",H123=\"\",I123=1,J123=1,K123=1),\"Check only ONE box under New Reporter.\",IF(AND(I123=\"\",L123>1),\"Too many check marks!\",IF(AND(H123=1,I123=1),\"Too many Checkmarks!\",\"\")))))","v":""}]
["1b",false,false,false,false,false,{"$f":"IF(B124=TRUE,1,\"\")","v":""},"","","","",0,""]
["1c",false,false,false,false,false,"","","","","",0,""]
["1d",false,false,false,false,false,"","","","","",0,""]
["1e",false,false,false,false,false,"","","","","",0,""]
["1f",false,false,false,false,false,"","","","","",0,""]
["1g",false,false,false,false,false,"","","","","",0,""]
["1h",false,false,false,false,false,"","","","","",0,""]
["1i",false,false,false,false,false,"","","","","",0,""]
["1j",false,false,false,false,false,"","","","","",0,""]
["1k",false,false,false,false,false,"","","","","",0,""]
["1l",false,false,false,false,false,"","","","","",0,""]
["1m",false,false,false,false,false,"","","","","",0,""]
["1n",false,false,false,false,false,"","","","","",0,""]
["1o",false,false,false,false,false,"","","","","",0,""]
["1p",false,false,false,false,false,"","","","","",0,""]
[]
[]
[""]
[]
["Page 7","Yes ","No"]
[1,false,false,{"$f":"IF(AND('Data Collections'!B144=TRUE,'Data Collections'!C144=TRUE),\"Check Only One Box\",\"\")","v":""}]
["1a",false,false,{"$f":"IF(AND('Data Collections'!B145=TRUE,'Data Collections'!C145=TRUE),\"Check Only One Box\",\"\")","v":""}]
[2,false,false,{"$f":"IF(AND('Data Collections'!B146=TRUE,'Data Collections'!C146=TRUE),\"Check Only One Box\",\"\")","v":""}]
[]
[""]
[]
[]
[""]
[]
[]
[""]
[]
[]
[]
[]
[]
[]
[]
[]
[]
["Page 8",null,null,null,null,null,"Prod List","Report Type"]
[null,"Yes ","No",null,null,null,"Butter","Separate"]
[5,false,false,{"$f":"IF(AND('Data Collections'!B166=TRUE,'Data Collections'!C166=TRUE),\"Check Only One Box\",\"\")","v":""},null,null,"CC40","Combined"]
[6,false,false,{"$f":"IF(AND('Data Collections'!B167=TRUE,'Data Collections'!C167=TRUE),\"Check Only One Box\",\"\")","v":""},null,null,"CC500"]
[null,null,null,null,null,null,"NFDM"]
[null,null,null,null,null,null,"Dry Whey"]
["General Survry Comments:"]
[""]

{"sheet":"Page 8 of 8 (2)","index":9,"n_rows":58,"n_cols":25,"rows_kept":58,"cut":false,"hidden":true,"merged":[[3,2,3,7],[3,8,4,12],[3,13,4,17],[3,18,4,20],[3,21,4,22],[4,2,4,3],[4,4,4,7],[5,2,7,3],[5,4,7,7],[5,8,7,12],[5,13,7,17],[5,18,5,20],[5,21,5,22],[6,18,6,20],[6,21,6,22],[7,18,7,20],[7,21,7,22],[8,2,10,3],[8,4,10,7],[8,8,10,12],[8,13,10,17],[8,18,8,20],[8,21,8,22],[9,18,9,20],[9,21,9,22],[10,18,10,20],[10,21,10,22],[11,2,13,3],[11,4,13,7],[11,8,13,12],[11,13,13,17],[11,18,11,20],[11,21,11,22],[12,18,12,20],[12,21,12,22],[13,18,13,20],[13,21,13,22],[14,2,16,3],[14,4,16,7],[14,8,16,12],[14,13,16,17],[14,18,14,20],[14,21,14,22],[15,18,15,20],[15,21,15,22],[16,18,16,20],[16,21,16,22],[17,2,19,3],[17,4,19,7],[17,8,19,12],[17,13,19,17],[17,18,17,20],[17,21,17,22],[18,18,18,20],[18,21,18,22],[19,18,19,20],[19,21,19,22],[20,2,22,3],[20,4,22,7],[20,8,22,12],[20,13,22,17],[20,18,20,20],[20,21,20,22],[21,18,21,20],[21,21,21,22],[22,18,22,20],[22,21,22,22],[23,2,25,3],[23,4,25,7],[23,8,25,12],[23,13,25,17],[23,18,23,20],[23,21,23,22],[24,18,24,20],[24,21,24,22],[25,18,25,20],[25,21,25,22],[26,2,28,3],[26,4,28,7],[26,8,28,12],[26,13,28,17],[26,18,26,20],[26,21,26,22],[27,18,27,20],[27,21,27,22],[28,18,28,20],[28,21,28,22],[29,2,31,3],[29,4,31,7],[29,8,31,12],[29,13,31,17],[29,18,29,20],[29,21,29,22],[30,18,30,20],[30,21,30,22],[31,18,31,20],[31,21,31,22],[32,2,34,3],[32,4,34,7],[32,8,34,12],[32,13,34,17],[32,18,32,20],[32,21,32,22],[33,18,33,20],[33,21,33,22],[34,18,34,20],[34,21,34,22],[35,2,37,3],[35,4,37,7],[35,8,37,12],[35,13,37,17],[35,18,35,20],[35,21,35,22],[36,18,36,20],[36,21,36,22],[37,18,37,20],[37,21,37,22],[38,2,40,3],[38,4,40,7],[38,8,40,12],[38,13,40,17],[38,18,38,20],[38,21,38,22],[39,18,39,20],[39,21,39,22],[40,18,40,20],[40,21,40,22],[41,2,43,3],[41,4,43,7],[41,8,43,12],[41,13,43,17],[41,18,41,20],[41,21,41,22],[42,18,42,20],[42,21,42,22],[43,18,43,20],[43,21,43,22],[57,19,57,23],[55,6,55,10],[55,11,55,12],[55,13,55,17],[56,13,56,18],[57,3,57,10],[57,11,57,12],[57,13,57,17],[47,2,47,17],[47,19,47,21],[53,2,53,5],[53,6,53,17],[53,20,53,22],[54,2,54,5],[54,6,54,22]]}
[]
[null,null,"Multiple Plants List Table:  [Interviewer Note: List Plant Name, Location, and Dairy Products "]
[null,null,"reported for all company locations currently included in submitting a weekly report.]"]
[null,null,"Office Use",null,null,null,null,null,"Plant Name",null,null,null,null,"Location",null,null,null,null,"Products\nReported",null,null,"Report\nType"]
[null,null,"Reporting\nID",null,"Plant\nID"]
[]
[]
[]
[]
[]
[]
[]
[]
[]
[]
[]
[]
[]
[]
[]
[]
[]
[]
[]
[]
[]
[]
[]
[]
[]
[]
[]
[]
[]
[]
[]
[]
[]
[]
[]
[]
[]
[]
[]
[]
[null,null,null,null,null,null,null,null,null,null,null,null,null,null,null,null,null,null,null,null,null,null,null,null,{"$f":"'Data Collections'!D166","v":""}]
[]
[]
[null,null,null,null,null,null,null,null,null,null,null,null,null,null,null,null,null,null,null,null,null,null,null,null,{"$f":"'Data Collections'!D167","v":""}]
[]
[]
[]
[]
[]
[]
[]
[]
[null,null,null,null,null,null,null,null,null,null,null,null,null,null,null,null,null,null,null,"Page 8 of 8 (2)"]

{"sheet":"PDF of Signature","index":10,"n_rows":35,"n_cols":2,"rows_kept":35,"cut":false,"hidden":false,"merged":[[34,0,36,8]]}
["Instructions for inserting a PDF (scan) of the signed page 8 of 8:"]
[]
["Click on the INSERT Ribbon (next to home) in Excel."]
[]
["Click on OBJECT"]
[]
[]
[]
["The insert an object will appear ( it should default to Adobe Acrobat Document). "]
[null,"Click OK,  Then browse to find your file, Then click OPEN"]
[]
[]
[]
[]
[]
[]
[]
[]
[]
[]
[]
[]
[]
[]
[]
[]
[]
[]
[]
[]
[]
[]
[]
[]
["Once you have inserted your Signed Page 8 of 8 PDF, you can move the Object to the upper left corner of this sheet."]

{"sheet":"Supplement Page 1 of 3","index":11,"n_rows":43,"n_cols":14,"rows_kept":43,"cut":false,"hidden":false,"merged":[[38,1,38,9],[9,11,10,11],[11,11,14,11],[15,11,18,11],[19,11,22,11],[23,11,26,11],[23,10,26,10],[25,1,26,1],[25,2,26,2],[25,4,26,4],[23,1,24,1],[23,2,24,2],[23,4,24,4],[23,5,26,5],[23,7,26,7],[23,8,26,8],[23,9,26,9],[19,10,22,10],[21,1,22,1],[21,2,22,2],[21,4,22,4],[19,1,20,1],[19,2,20,2],[19,4,20,4],[19,5,22,5],[19,7,22,7],[19,8,22,8],[19,9,22,9],[15,10,18,10],[17,1,18,1],[17,2,18,2],[17,4,18,4],[15,1,16,1],[15,2,16,2],[15,4,16,4],[15,5,18,5],[15,7,18,7],[15,8,18,8],[15,9,18,9],[11,10,14,10],[13,1,14,1],[13,2,14,2],[13,4,14,4],[11,1,12,1],[11,2,12,2],[11,4,12,4],[11,5,14,5],[11,7,14,7],[11,8,14,8],[11,9,14,9],[0,7,0,10],[1,1,1,7],[3,1,3,7],[9,10,10,10],[9,7,9,9],[5,1,7,7],[9,5,9,6],[10,5,10,6],[8,1,8,9]]}
[null,null,null,null,null,null,null,"OMB No. 0581-0274"]
[null,"Supplement - Multiple Plants Reporting Screening Table"]
[]
[null,"Note: This supplement is required for all operations answering \"YES\" to Question 1 in Section 1 of the Annual Validation."]
[]
[null,"1. Please list your company's headquarters location, all dairy plant locations, any plants/companies owned or partially owned producing or selling dairy products, plants/companies with whom you have tolling agreements, or plants/companies with whom you have exclusive marketing agreements."]
[]
[]
[null,"             Interviewer Note: List Company Name, Plant Name, Physical Address, Mailing Address, Contact, Telephone, and Dairy Products Produced for each location."]
[null,"Office Use","Company Name","Physical Address","Contact Name","List ALL Dairy Products                                                             Produced at Plant",null,"Question Answer Log                         (For plants with reportable products, answer questions in the boxes below)",null,null,"Check Box if Plant has Reportable Product",{"$f":"IF(Sheet1!P2=\"\",\"Check Box if plant is/should be reporting weekly by the contact listed on page 1 of 8\",\"Check Box if plant is/should be reporting weekly by the contact listed on page 1 of 8 (\"&Sheet1!P2&\")\")","v":"Check Box if plant is/should be reporting weekly by the contact listed on page 1 of 8"}]
[null,"Plant Id","Plant Name","Mailing Address","Telephone Number","(Check the box ONLY if ALL PRODUCTS LISTED are NOT REPORTABLE)",null,"Question 2","Question 3","Question 4"]
[null,"HQ",null,null,null,null,null,{"$f":"IF(OR($F12=\"None\",$F12=\"\"),\"\",\"Yes          No         Unknown\")","v":""},{"$f":"IF(OR($F12=\"None\",$F12=\"\"),\"\",\"Yes          No         Unknown\")","v":""},""]
[]
[]
[]
[null,"P1",null,null,null,null,null,{"$f":"IF(OR($F16=\"None\",$F16=\"\"),\"\",\"Yes          No         Unknown\")","v":""},"",""]
[]
[]
[]
[null,"P2",null,null,null,null,null,{"$f":"IF(OR($F20=\"None\",$F20=\"\"),\"\",\"Yes          No         Unknown\")","v":""},"",""]
[]
[]
[]
[null,"P3",null,null,null,null,null,{"$f":"IF(OR($F24=\"None\",$F24=\"\"),\"\",\"Yes          No         Unknown\")","v":""},"",""]
[]
[]
[]
[null,"[Interviewer Note: In the Question Answer Log - For each plant listed in the supplement with reportable products, answer questions 2, 3 and 4 listed below.]"]
[null,"2. Does your office have full access to (insert Plant Name of each entry) weekly sales data (i.e. all ledgers, contracts,"]
[null,"      invoices, and cash receipts)?"]
[null,null,null,null,null,null,null,null,null,null,null,null,null,"either have the yes/no in either the boxes or under the questions"]
[]
[null,"3. Does (insert Plant Name of each entry) produce and/or market products outside of the information you can provide to AMS (i.e. cheese is"]
[null,"      reported through your office but the plant listed above sells dry whey using a different office)?"]
[]
[]
[null,"4. Does (insert Plant Name of each entry) market products of the same type outside of information you can provide to AMS (i.e. the plant"]
[null,"      listed above may have cash sales you cannot access)?"]
[null,"5. If any of the above are checked “No” or \"Unknown\", please explain: (Shift+Enter or Ctrl+Enter for a new line in text box below)"]
[]
[]
[]
[null,"[After completion of the supplement return to the Annual Validation Worksheet in Section 1, Question 2.]"]

{"sheet":"Supplement Page 2 of 3","index":12,"n_rows":41,"n_cols":12,"rows_kept":41,"cut":false,"hidden":false,"merged":[[36,11,39,11],[40,11,43,11],[2,11,3,11],[4,11,7,11],[8,11,11,11],[12,11,15,11],[16,11,19,11],[20,11,23,11],[24,11,27,11],[28,11,31,11],[32,11,35,11],[40,10,43,10],[42,1,43,1],[42,2,43,2],[42,4,43,4],[36,10,39,10],[38,1,39,1],[38,2,39,2],[38,4,39,4],[40,1,41,1],[40,2,41,2],[40,4,41,4],[40,5,43,5],[36,1,37,1],[36,2,37,2],[36,4,37,4],[36,5,39,5],[36,7,39,7],[36,8,39,8],[36,9,39,9],[40,7,43,7],[40,8,43,8],[40,9,43,9],[32,10,35,10],[34,1,35,1],[34,2,35,2],[34,4,35,4],[28,10,31,10],[30,1,31,1],[30,2,31,2],[30,4,31,4],[32,1,33,1],[32,2,33,2],[32,4,33,4],[32,5,35,5],[28,1,29,1],[28,2,29,2],[28,4,29,4],[28,5,31,5],[28,7,31,7],[28,8,31,8],[28,9,31,9],[32,7,35,7],[32,8,35,8],[32,9,35,9],[16,9,19,9],[24,10,27,10],[26,1,27,1],[26,2,27,2],[26,4,27,4],[20,10,23,10],[22,1,23,1],[22,2,23,2],[22,4,23,4],[24,1,25,1],[24,2,25,2],[24,4,25,4],[24,5,27,5],[20,1,21,1],[20,2,21,2],[20,4,21,4],[20,5,23,5],[20,7,23,7],[20,8,23,8],[20,9,23,9],[24,7,27,7],[24,8,27,8],[24,9,27,9],[4,7,7,7],[4,8,7,8],[4,9,7,9],[16,10,19,10],[18,1,19,1],[18,2,19,2],[18,4,19,4],[12,10,15,10],[14,1,15,1],[14,2,15,2],[14,4,15,4],[16,1,17,1],[16,2,17,2],[16,4,17,4],[16,5,19,5],[12,1,13,1],[12,2,13,2],[12,4,13,4],[12,5,15,5],[12,7,15,7],[12,8,15,8],[12,9,15,9],[16,7,19,7],[16,8,19,8],[2,7,2,9],[2,5,2,6],[3,5,3,6],[1,1,1,9],[8,10,11,10],[10,1,11,1],[10,2,11,2],[10,4,11,4],[4,10,7,10],[6,1,7,1],[6,2,7,2],[6,4,7,4],[8,1,9,1],[8,2,9,2],[8,4,9,4],[8,5,11,5],[8,7,11,7],[8,8,11,8],[8,9,11,9],[2,10,3,10],[4,1,5,1],[4,2,5,2],[4,4,5,4],[4,5,7,5]]}
[]
[null,"             Interviewer Note: List Company Name, Plant Name, Physical Address, Mailing Address, Contact, Telephone, and Dairy Products Produced for each location."]
[null,"Office Use","Company Name","Physical Address","Contact Name","List ALL Dairy Products                                                             Produced at Plant",null,"Question Answer Log                    (For plants with reportable products, answer questions in the boxes below)",null,null,"Check Box if Plant has Reportable Product",{"$f":"IF(Sheet1!P2=\"\",\"Check Box if plant is/should be reporting weekly by the contact listed on page 1 of 8\",\"Check Box if plant is/should be reporting weekly by the contact listed on page 1 of 8 (\"&Sheet1!P2&\")\")","v":"Check Box if plant is/should be reporting weekly by the contact listed on page 1 of 8"}]
[null,"Plant Id","Plant Name","Mailing Address","Telephone Number","(Check the box ONLY if ALL PRODUCTS LISTED are NOT REPORTABLE)",null,"Question 2","Question 3","Question 4"]
[null,"P4",null,null,null,null,null,{"$f":"IF(OR($F5=\"None\",$F5=\"\"),\"\",\"Yes          No         Unknown\")","v":""},{"$f":"IF(OR($F5=\"None\",$F5=\"\"),\"\",\"Yes          No         Unknown\")","v":""},{"$f":"IF(OR($F5=\"None\",$F5=\"\"),\"\",\"Yes          No         Unknown\")","v":""}]
[]
[]
[]
[null,"P5",null,null,null,null,null,{"$f":"IF(OR($F9=\"None\",$F9=\"\"),\"\",\"Yes          No         Unknown\")","v":""},{"$f":"IF(OR($F9=\"None\",$F9=\"\"),\"\",\"Yes          No         Unknown\")","v":""},{"$f":"IF(OR($F9=\"None\",$F9=\"\"),\"\",\"Yes          No         Unknown\")","v":""}]
[]
[]
[]
[null,"P6",null,null,null,null,null,{"$f":"IF(OR($F13=\"None\",$F13=\"\"),\"\",\"Yes          No         Unknown\")","v":""},{"$f":"IF(OR($F13=\"None\",$F13=\"\"),\"\",\"Yes          No         Unknown\")","v":""},{"$f":"IF(OR($F13=\"None\",$F13=\"\"),\"\",\"Yes          No         Unknown\")","v":""}]
[]
[]
[]
[null,"P7",null,null,null,null,null,{"$f":"IF(OR($F17=\"None\",$F17=\"\"),\"\",\"Yes          No         Unknown\")","v":""},{"$f":"IF(OR($F17=\"None\",$F17=\"\"),\"\",\"Yes          No         Unknown\")","v":""},{"$f":"IF(OR($F17=\"None\",$F17=\"\"),\"\",\"Yes          No         Unknown\")","v":""}]
[]
[]
[]
[null,"P8",null,null,null,null,null,{"$f":"IF(OR($F21=\"None\",$F21=\"\"),\"\",\"Yes          No         Unknown\")","v":""},{"$f":"IF(OR($F21=\"None\",$F21=\"\"),\"\",\"Yes          No         Unknown\")","v":""},{"$f":"IF(OR($F21=\"None\",$F21=\"\"),\"\",\"Yes          No         Unknown\")","v":""}]
[]
[]
[]
[null,"P9",null,null,null,null,null,{"$f":"IF(OR($F25=\"None\",$F25=\"\"),\"\",\"Yes          No         Unknown\")","v":""},{"$f":"IF(OR($F25=\"None\",$F25=\"\"),\"\",\"Yes          No         Unknown\")","v":""},{"$f":"IF(OR($F25=\"None\",$F25=\"\"),\"\",\"Yes          No         Unknown\")","v":""}]
[]
[]
[]
[null,"P10",null,null,null,null,null,{"$f":"IF(OR($F29=\"None\",$F29=\"\"),\"\",\"Yes          No         Unknown\")","v":""},{"$f":"IF(OR($F29=\"None\",$F29=\"\"),\"\",\"Yes          No         Unknown\")","v":""},{"$f":"IF(OR($F29=\"None\",$F29=\"\"),\"\",\"Yes          No         Unknown\")","v":""}]
[]
[]
[]
[null,"P11",null,null,null,null,null,{"$f":"IF(OR($F33=\"None\",$F33=\"\"),\"\",\"Yes          No         Unknown\")","v":""},{"$f":"IF(OR($F33=\"None\",$F33=\"\"),\"\",\"Yes          No         Unknown\")","v":""},{"$f":"IF(OR($F33=\"None\",$F33=\"\"),\"\",\"Yes          No         Unknown\")","v":""}]
[]
[]
[]
[null,"P12",null,null,null,null,null,{"$f":"IF(OR($F37=\"None\",$F37=\"\"),\"\",\"Yes          No         Unknown\")","v":""},{"$f":"IF(OR($F37=\"None\",$F37=\"\"),\"\",\"Yes          No         Unknown\")","v":""},{"$f":"IF(OR($F37=\"None\",$F37=\"\"),\"\",\"Yes          No         Unknown\")","v":""}]
[]
[]
[]
[null,"P13",null,null,null,null,null,{"$f":"IF(OR($F41=\"None\",$F41=\"\"),\"\",\"Yes          No         Unknown\")","v":""},{"$f":"IF(OR($F41=\"None\",$F41=\"\"),\"\",\"Yes          No         Unknown\")","v":""},{"$f":"IF(OR($F41=\"None\",$F41=\"\"),\"\",\"Yes          No         Unknown\")","v":""}]

{"sheet":"Supplement Page 3 of 3","index":13,"n_rows":41,"n_cols":12,"rows_kept":41,"cut":false,"hidden":false,"merged":[[36,11,39,11],[40,11,43,11],[2,11,3,11],[4,11,7,11],[8,11,11,11],[12,11,15,11],[16,11,19,11],[20,11,23,11],[24,11,27,11],[28,11,31,11],[32,11,35,11],[40,8,43,8],[40,9,43,9],[40,10,43,10],[42,1,43,1],[42,2,43,2],[42,4,43,4],[36,9,39,9],[36,10,39,10],[38,1,39,1],[38,2,39,2],[38,4,39,4],[40,1,41,1],[40,2,41,2],[40,4,41,4],[40,5,43,5],[40,7,43,7],[36,1,37,1],[36,2,37,2],[36,4,37,4],[36,5,39,5],[36,7,39,7],[36,8,39,8],[32,8,35,8],[32,9,35,9],[32,10,35,10],[34,1,35,1],[34,2,35,2],[34,4,35,4],[28,9,31,9],[28,10,31,10],[30,1,31,1],[30,2,31,2],[30,4,31,4],[32,1,33,1],[32,2,33,2],[32,4,33,4],[32,5,35,5],[32,7,35,7],[28,1,29,1],[28,2,29,2],[28,4,29,4],[28,5,31,5],[28,7,31,7],[28,8,31,8],[24,8,27,8],[24,9,27,9],[24,10,27,10],[26,1,27,1],[26,2,27,2],[26,4,27,4],[20,9,23,9],[20,10,23,10],[22,1,23,1],[22,2,23,2],[22,4,23,4],[24,1,25,1],[24,2,25,2],[24,4,25,4],[24,5,27,5],[24,7,27,7],[20,1,21,1],[20,2,21,2],[20,4,21,4],[20,5,23,5],[20,7,23,7],[20,8,23,8],[16,8,19,8],[16,9,19,9],[16,10,19,10],[18,1,19,1],[18,2,19,2],[18,4,19,4],[12,9,15,9],[12,10,15,10],[14,1,15,1],[14,2,15,2],[14,4,15,4],[16,1,17,1],[16,2,17,2],[16,4,17,4],[16,5,19,5],[16,7,19,7],[12,1,13,1],[12,2,13,2],[12,4,13,4],[12,5,15,5],[12,7,15,7],[12,8,15,8],[8,8,11,8],[8,9,11,9],[8,10,11,10],[10,1,11,1],[10,2,11,2],[10,4,11,4],[4,9,7,9],[4,10,7,10],[6,1,7,1],[6,2,7,2],[6,4,7,4],[8,1,9,1],[8,2,9,2],[8,4,9,4],[8,5,11,5],[8,7,11,7],[2,7,2,9],[2,10,3,10],[4,1,5,1],[4,2,5,2],[4,4,5,4],[4,5,7,5],[4,7,7,7],[4,8,7,8],[1,1,1,10],[2,5,2,6],[3,5,3,6]]}
[]
[null,"             Interviewer Note: List Company Name, Plant Name, Physical Address, Mailing Address, Contact, Telephone, and Dairy Products Produced for each location."]
[null,"Office Use","Company Name","Physical Address","Contact Name","List ALL Dairy Products                                                             Produced at Plant",null,"Question Answer Log                    (For plants with reportable products, answer questions in the boxes below)",null,null,"Check Box if Plant has Reportable Product",{"$f":"IF(Sheet1!P2=\"\",\"Check Box if plant is/should be reporting weekly by the contact listed on page 1 of 8\",\"Check Box if plant is/should be reporting weekly by the contact listed on page 1 of 8 (\"&Sheet1!P2&\")\")","v":"Check Box if plant is/should be reporting weekly by the contact listed on page 1 of 8"}]
[null,"Plant Id","Plant Name","Mailing Address","Telephone Number","(Check the box ONLY if ALL PRODUCTS LISTED are NOT REPORTABLE)",null,"Question 2","Question 3","Question 4"]
[null,"P14",null,null,null,null,null,{"$f":"IF(OR($F5=\"None\",$F5=\"\"),\"\",\"Yes          No         Unknown\")","v":""},{"$f":"IF(OR($F5=\"None\",$F5=\"\"),\"\",\"Yes          No         Unknown\")","v":""},{"$f":"IF(OR($F5=\"None\",$F5=\"\"),\"\",\"Yes          No         Unknown\")","v":""}]
[]
[]
[]
[null,"P15",null,null,null,null,null,{"$f":"IF(OR($F9=\"None\",$F9=\"\"),\"\",\"Yes          No         Unknown\")","v":""},{"$f":"IF(OR($F9=\"None\",$F9=\"\"),\"\",\"Yes          No         Unknown\")","v":""},{"$f":"IF(OR($F9=\"None\",$F9=\"\"),\"\",\"Yes          No         Unknown\")","v":""}]
[]
[]
[]
[null,"P16",null,null,null,null,null,{"$f":"IF(OR($F13=\"None\",$F13=\"\"),\"\",\"Yes          No         Unknown\")","v":""},{"$f":"IF(OR($F13=\"None\",$F13=\"\"),\"\",\"Yes          No         Unknown\")","v":""},{"$f":"IF(OR($F13=\"None\",$F13=\"\"),\"\",\"Yes          No         Unknown\")","v":""}]
[]
[]
[]
[null,"P17",null,null,null,null,null,{"$f":"IF(OR($F17=\"None\",$F17=\"\"),\"\",\"Yes          No         Unknown\")","v":""},{"$f":"IF(OR($F17=\"None\",$F17=\"\"),\"\",\"Yes          No         Unknown\")","v":""},{"$f":"IF(OR($F17=\"None\",$F17=\"\"),\"\",\"Yes          No         Unknown\")","v":""}]
[]
[]
[]
[null,"P18",null,null,null,null,null,{"$f":"IF(OR($F21=\"None\",$F21=\"\"),\"\",\"Yes          No         Unknown\")","v":""},{"$f":"IF(OR($F21=\"None\",$F21=\"\"),\"\",\"Yes          No         Unknown\")","v":""},{"$f":"IF(OR($F21=\"None\",$F21=\"\"),\"\",\"Yes          No         Unknown\")","v":""}]
[]
[]
[]
[null,"P19",null,null,null,null,null,{"$f":"IF(OR($F25=\"None\",$F25=\"\"),\"\",\"Yes          No         Unknown\")","v":""},{"$f":"IF(OR($F25=\"None\",$F25=\"\"),\"\",\"Yes          No         Unknown\")","v":""},{"$f":"IF(OR($F25=\"None\",$F25=\"\"),\"\",\"Yes          No         Unknown\")","v":""}]
[]
[]
[]
[null,"P20",null,null,null,null,null,{"$f":"IF(OR($F29=\"None\",$F29=\"\"),\"\",\"Yes          No         Unknown\")","v":""},{"$f":"IF(OR($F29=\"None\",$F29=\"\"),\"\",\"Yes          No         Unknown\")","v":""},{"$f":"IF(OR($F29=\"None\",$F29=\"\"),\"\",\"Yes          No         Unknown\")","v":""}]
[]
[]
[]
[null,"P21",null,null,null,null,null,{"$f":"IF(OR($F33=\"None\",$F33=\"\"),\"\",\"Yes          No         Unknown\")","v":""},{"$f":"IF(OR($F33=\"None\",$F33=\"\"),\"\",\"Yes          No         Unknown\")","v":""},{"$f":"IF(OR($F33=\"None\",$F33=\"\"),\"\",\"Yes          No         Unknown\")","v":""}]
[]
[]
[]
[null,"P22",null,null,null,null,null,{"$f":"IF(OR($F37=\"None\",$F37=\"\"),\"\",\"Yes          No         Unknown\")","v":""},{"$f":"IF(OR($F37=\"None\",$F37=\"\"),\"\",\"Yes          No         Unknown\")","v":""},{"$f":"IF(OR($F37=\"None\",$F37=\"\"),\"\",\"Yes          No         Unknown\")","v":""}]
[]
[]
[]
[null,"P23",null,null,null,null,null,{"$f":"IF(OR($F41=\"None\",$F41=\"\"),\"\",\"Yes          No         Unknown\")","v":""},{"$f":"IF(OR($F41=\"None\",$F41=\"\"),\"\",\"Yes          No         Unknown\")","v":""},{"$f":"IF(OR($F41=\"None\",$F41=\"\"),\"\",\"Yes          No         Unknown\")","v":""}]

{"sheet":"Supplement Page 4","index":14,"n_rows":41,"n_cols":12,"rows_kept":41,"cut":false,"hidden":false,"merged":[[40,9,43,9],[40,10,43,10],[40,11,43,11],[42,1,43,1],[42,2,43,2],[42,4,43,4],[40,1,41,1],[40,2,41,2],[40,4,41,4],[40,5,43,5],[40,7,43,7],[40,8,43,8],[36,9,39,9],[36,10,39,10],[36,11,39,11],[38,1,39,1],[38,2,39,2],[38,4,39,4],[36,1,37,1],[36,2,37,2],[36,4,37,4],[36,5,39,5],[36,7,39,7],[36,8,39,8],[32,9,35,9],[32,10,35,10],[32,11,35,11],[34,1,35,1],[34,2,35,2],[34,4,35,4],[32,1,33,1],[32,2,33,2],[32,4,33,4],[32,5,35,5],[32,7,35,7],[32,8,35,8],[28,9,31,9],[28,10,31,10],[28,11,31,11],[30,1,31,1],[30,2,31,2],[30,4,31,4],[28,1,29,1],[28,2,29,2],[28,4,29,4],[28,5,31,5],[28,7,31,7],[28,8,31,8],[24,9,27,9],[24,10,27,10],[24,11,27,11],[26,1,27,1],[26,2,27,2],[26,4,27,4],[24,1,25,1],[24,2,25,2],[24,4,25,4],[24,5,27,5],[24,7,27,7],[24,8,27,8],[20,9,23,9],[20,10,23,10],[20,11,23,11],[22,1,23,1],[22,2,23,2],[22,4,23,4],[20,1,21,1],[20,2,21,2],[20,4,21,4],[20,5,23,5],[20,7,23,7],[20,8,23,8],[16,9,19,9],[16,10,19,10],[16,11,19,11],[18,1,19,1],[18,2,19,2],[18,4,19,4],[16,1,17,1],[16,2,17,2],[16,4,17,4],[16,5,19,5],[16,7,19,7],[16,8,19,8],[12,9,15,9],[12,10,15,10],[12,11,15,11],[14,1,15,1],[14,2,15,2],[14,4,15,4],[12,1,13,1],[12,2,13,2],[12,4,13,4],[12,5,15,5],[12,7,15,7],[12,8,15,8],[8,9,11,9],[8,10,11,10],[8,11,11,11],[10,1,11,1],[10,2,11,2],[10,4,11,4],[8,1,9,1],[8,2,9,2],[8,4,9,4],[8,5,11,5],[8,7,11,7],[8,8,11,8],[1,1,1,10],[2,5,2,6],[2,7,2,9],[2,10,3,10],[2,11,3,11],[3,5,3,6],[4,9,7,9],[4,10,7,10],[4,11,7,11],[6,1,7,1],[6,2,7,2],[6,4,7,4],[4,1,5,1],[4,2,5,2],[4,4,5,4],[4,5,7,5],[4,7,7,7],[4,8,7,8]]}
[]
[null,"             Interviewer Note: List Company Name, Plant Name, Physical Address, Mailing Address, Contact, Telephone, and Dairy Products Produced for each location."]
[null,"Office Use","Company Name","Physical Address","Contact Name","List ALL Dairy Products                                                             Produced at Plant",null,"Question Answer Log                    (For plants with reportable products, answer questions in the boxes below)",null,null,"Check Box if Plant has Reportable Product",{"$f":"IF(Sheet1!P2=\"\",\"Check Box if plant is/should be reporting weekly by the contact listed on page 1 of 8\",\"Check Box if plant is/should be reporting weekly by the contact listed on page 1 of 8 (\"&Sheet1!P2&\")\")","v":"Check Box if plant is/should be reporting weekly by the contact listed on page 1 of 8"}]
[null,"Plant Id","Plant Name","Mailing Address","Telephone Number","(Check the box ONLY if ALL PRODUCTS LISTED are NOT REPORTABLE)",null,"Question 2","Question 3","Question 4"]
[null,"P24",null,null,null,null,null,{"$f":"IF(OR($F5=\"None\",$F5=\"\"),\"\",\"Yes          No         Unknown\")","v":""},{"$f":"IF(OR($F5=\"None\",$F5=\"\"),\"\",\"Yes          No         Unknown\")","v":""},{"$f":"IF(OR($F5=\"None\",$F5=\"\"),\"\",\"Yes          No         Unknown\")","v":""}]
[]
[]
[]
[null,"P25",null,null,null,null,null,{"$f":"IF(OR($F9=\"None\",$F9=\"\"),\"\",\"Yes          No         Unknown\")","v":""},{"$f":"IF(OR($F9=\"None\",$F9=\"\"),\"\",\"Yes          No         Unknown\")","v":""},{"$f":"IF(OR($F9=\"None\",$F9=\"\"),\"\",\"Yes          No         Unknown\")","v":""}]
[]
[]
[]
[null,"P26",null,null,null,null,null,{"$f":"IF(OR($F13=\"None\",$F13=\"\"),\"\",\"Yes          No         Unknown\")","v":""},{"$f":"IF(OR($F13=\"None\",$F13=\"\"),\"\",\"Yes          No         Unknown\")","v":""},{"$f":"IF(OR($F13=\"None\",$F13=\"\"),\"\",\"Yes          No         Unknown\")","v":""}]
[]
[]
[]
[null,"P27",null,null,null,null,null,{"$f":"IF(OR($F17=\"None\",$F17=\"\"),\"\",\"Yes          No         Unknown\")","v":""},{"$f":"IF(OR($F17=\"None\",$F17=\"\"),\"\",\"Yes          No         Unknown\")","v":""},{"$f":"IF(OR($F17=\"None\",$F17=\"\"),\"\",\"Yes          No         Unknown\")","v":""}]
[]
[]
[]
[null,"P28",null,null,null,null,null,{"$f":"IF(OR($F21=\"None\",$F21=\"\"),\"\",\"Yes          No         Unknown\")","v":""},{"$f":"IF(OR($F21=\"None\",$F21=\"\"),\"\",\"Yes          No         Unknown\")","v":""},{"$f":"IF(OR($F21=\"None\",$F21=\"\"),\"\",\"Yes          No         Unknown\")","v":""}]
[]
[]
[]
[null,"P29",null,null,null,null,null,{"$f":"IF(OR($F25=\"None\",$F25=\"\"),\"\",\"Yes          No         Unknown\")","v":""},{"$f":"IF(OR($F25=\"None\",$F25=\"\"),\"\",\"Yes          No         Unknown\")","v":""},{"$f":"IF(OR($F25=\"None\",$F25=\"\"),\"\",\"Yes          No         Unknown\")","v":""}]
[]
[]
[]
[null,"P30",null,null,null,null,null,{"$f":"IF(OR($F29=\"None\",$F29=\"\"),\"\",\"Yes          No         Unknown\")","v":""},{"$f":"IF(OR($F29=\"None\",$F29=\"\"),\"\",\"Yes          No         Unknown\")","v":""},{"$f":"IF(OR($F29=\"None\",$F29=\"\"),\"\",\"Yes          No         Unknown\")","v":""}]
[]
[]
[]
[null,"P31",null,null,null,null,null,{"$f":"IF(OR($F33=\"None\",$F33=\"\"),\"\",\"Yes          No         Unknown\")","v":""},{"$f":"IF(OR($F33=\"None\",$F33=\"\"),\"\",\"Yes          No         Unknown\")","v":""},{"$f":"IF(OR($F33=\"None\",$F33=\"\"),\"\",\"Yes          No         Unknown\")","v":""}]
[]
[]
[]
[null,"P32",null,null,null,null,null,{"$f":"IF(OR($F37=\"None\",$F37=\"\"),\"\",\"Yes          No         Unknown\")","v":""},{"$f":"IF(OR($F37=\"None\",$F37=\"\"),\"\",\"Yes          No         Unknown\")","v":""},{"$f":"IF(OR($F37=\"None\",$F37=\"\"),\"\",\"Yes          No         Unknown\")","v":""}]
[]
[]
[]
[null,"P33",null,null,null,null,null,{"$f":"IF(OR($F41=\"None\",$F41=\"\"),\"\",\"Yes          No         Unknown\")","v":""},{"$f":"IF(OR($F41=\"None\",$F41=\"\"),\"\",\"Yes          No         Unknown\")","v":""},{"$f":"IF(OR($F41=\"None\",$F41=\"\"),\"\",\"Yes          No         Unknown\")","v":""}]

{"sheet":"Supplement Page 5","index":15,"n_rows":41,"n_cols":12,"rows_kept":41,"cut":false,"hidden":false,"merged":[[40,9,43,9],[40,10,43,10],[40,11,43,11],[42,1,43,1],[42,2,43,2],[42,4,43,4],[40,1,41,1],[40,2,41,2],[40,4,41,4],[40,5,43,5],[40,7,43,7],[40,8,43,8],[36,9,39,9],[36,10,39,10],[36,11,39,11],[38,1,39,1],[38,2,39,2],[38,4,39,4],[36,1,37,1],[36,2,37,2],[36,4,37,4],[36,5,39,5],[36,7,39,7],[36,8,39,8],[32,9,35,9],[32,10,35,10],[32,11,35,11],[34,1,35,1],[34,2,35,2],[34,4,35,4],[32,1,33,1],[32,2,33,2],[32,4,33,4],[32,5,35,5],[32,7,35,7],[32,8,35,8],[28,9,31,9],[28,10,31,10],[28,11,31,11],[30,1,31,1],[30,2,31,2],[30,4,31,4],[28,1,29,1],[28,2,29,2],[28,4,29,4],[28,5,31,5],[28,7,31,7],[28,8,31,8],[24,9,27,9],[24,10,27,10],[24,11,27,11],[26,1,27,1],[26,2,27,2],[26,4,27,4],[24,1,25,1],[24,2,25,2],[24,4,25,4],[24,5,27,5],[24,7,27,7],[24,8,27,8],[20,9,23,9],[20,10,23,10],[20,11,23,11],[22,1,23,1],[22,2,23,2],[22,4,23,4],[20,1,21,1],[20,2,21,2],[20,4,21,4],[20,5,23,5],[20,7,23,7],[20,8,23,8],[16,9,19,9],[16,10,19,10],[16,11,19,11],[18,1,19,1],[18,2,19,2],[18,4,19,4],[16,1,17,1],[16,2,17,2],[16,4,17,4],[16,5,19,5],[16,7,19,7],[16,8,19,8],[12,9,15,9],[12,10,15,10],[12,11,15,11],[14,1,15,1],[14,2,15,2],[14,4,15,4],[12,1,13,1],[12,2,13,2],[12,4,13,4],[12,5,15,5],[12,7,15,7],[12,8,15,8],[8,9,11,9],[8,10,11,10],[8,11,11,11],[10,1,11,1],[10,2,11,2],[10,4,11,4],[8,1,9,1],[8,2,9,2],[8,4,9,4],[8,5,11,5],[8,7,11,7],[8,8,11,8],[1,1,1,10],[2,5,2,6],[2,7,2,9],[2,10,3,10],[2,11,3,11],[3,5,3,6],[4,9,7,9],[4,10,7,10],[4,11,7,11],[6,1,7,1],[6,2,7,2],[6,4,7,4],[4,1,5,1],[4,2,5,2],[4,4,5,4],[4,5,7,5],[4,7,7,7],[4,8,7,8]]}
[]
[null,"             Interviewer Note: List Company Name, Plant Name, Physical Address, Mailing Address, Contact, Telephone, and Dairy Products Produced for each location."]
[null,"Office Use","Company Name","Physical Address","Contact Name","List ALL Dairy Products                                                             Produced at Plant",null,"Question Answer Log                    (For plants with reportable products, answer questions in the boxes below)",null,null,"Check Box if Plant has Reportable Product",{"$f":"IF(Sheet1!P2=\"\",\"Check Box if plant is/should be reporting weekly by the contact listed on page 1 of 8\",\"Check Box if plant is/should be reporting weekly by the contact listed on page 1 of 8 (\"&Sheet1!P2&\")\")","v":"Check Box if plant is/should be reporting weekly by the contact listed on page 1 of 8"}]
[null,"Plant Id","Plant Name","Mailing Address","Telephone Number","(Check the box ONLY if ALL PRODUCTS LISTED are NOT REPORTABLE)",null,"Question 2","Question 3","Question 4"]
[null,"P34",null,null,null,null,null,{"$f":"IF(OR($F5=\"None\",$F5=\"\"),\"\",\"Yes          No         Unknown\")","v":""},{"$f":"IF(OR($F5=\"None\",$F5=\"\"),\"\",\"Yes          No         Unknown\")","v":""},{"$f":"IF(OR($F5=\"None\",$F5=\"\"),\"\",\"Yes          No         Unknown\")","v":""}]
[]
[]
[]
[null,"P35",null,null,null,null,null,{"$f":"IF(OR($F9=\"None\",$F9=\"\"),\"\",\"Yes          No         Unknown\")","v":""},{"$f":"IF(OR($F9=\"None\",$F9=\"\"),\"\",\"Yes          No         Unknown\")","v":""},{"$f":"IF(OR($F9=\"None\",$F9=\"\"),\"\",\"Yes          No         Unknown\")","v":""}]
[]
[]
[]
[null,"P36",null,null,null,null,null,{"$f":"IF(OR($F13=\"None\",$F13=\"\"),\"\",\"Yes          No         Unknown\")","v":""},{"$f":"IF(OR($F13=\"None\",$F13=\"\"),\"\",\"Yes          No         Unknown\")","v":""},{"$f":"IF(OR($F13=\"None\",$F13=\"\"),\"\",\"Yes          No         Unknown\")","v":""}]
[]
[]
[]
[null,"P37",null,null,null,null,null,{"$f":"IF(OR($F17=\"None\",$F17=\"\"),\"\",\"Yes          No         Unknown\")","v":""},{"$f":"IF(OR($F17=\"None\",$F17=\"\"),\"\",\"Yes          No         Unknown\")","v":""},{"$f":"IF(OR($F17=\"None\",$F17=\"\"),\"\",\"Yes          No         Unknown\")","v":""}]
[]
[]
[]
[null,"P38",null,null,null,null,null,{"$f":"IF(OR($F21=\"None\",$F21=\"\"),\"\",\"Yes          No         Unknown\")","v":""},{"$f":"IF(OR($F21=\"None\",$F21=\"\"),\"\",\"Yes          No         Unknown\")","v":""},{"$f":"IF(OR($F21=\"None\",$F21=\"\"),\"\",\"Yes          No         Unknown\")","v":""}]
[]
[]
[]
[null,"P39",null,null,null,null,null,{"$f":"IF(OR($F25=\"None\",$F25=\"\"),\"\",\"Yes          No         Unknown\")","v":""},{"$f":"IF(OR($F25=\"None\",$F25=\"\"),\"\",\"Yes          No         Unknown\")","v":""},{"$f":"IF(OR($F25=\"None\",$F25=\"\"),\"\",\"Yes          No         Unknown\")","v":""}]
[]
[]
[]
[null,"P40",null,null,null,null,null,{"$f":"IF(OR($F29=\"None\",$F29=\"\"),\"\",\"Yes          No         Unknown\")","v":""},{"$f":"IF(OR($F29=\"None\",$F29=\"\"),\"\",\"Yes          No         Unknown\")","v":""},{"$f":"IF(OR($F29=\"None\",$F29=\"\"),\"\",\"Yes          No         Unknown\")","v":""}]
[]
[]
[]
[null,"P41",null,null,null,null,null,{"$f":"IF(OR($F33=\"None\",$F33=\"\"),\"\",\"Yes          No         Unknown\")","v":""},{"$f":"IF(OR($F33=\"None\",$F33=\"\"),\"\",\"Yes          No         Unknown\")","v":""},{"$f":"IF(OR($F33=\"None\",$F33=\"\"),\"\",\"Yes          No         Unknown\")","v":""}]
[]
[]
[]
[null,"P42",null,null,null,null,null,{"$f":"IF(OR($F37=\"None\",$F37=\"\"),\"\",\"Yes          No         Unknown\")","v":""},{"$f":"IF(OR($F37=\"None\",$F37=\"\"),\"\",\"Yes          No         Unknown\")","v":""},{"$f":"IF(OR($F37=\"None\",$F37=\"\"),\"\",\"Yes          No         Unknown\")","v":""}]
[]
[]
[]
[null,"P43",null,null,null,null,null,{"$f":"IF(OR($F41=\"None\",$F41=\"\"),\"\",\"Yes          No         Unknown\")","v":""},{"$f":"IF(OR($F41=\"None\",$F41=\"\"),\"\",\"Yes          No         Unknown\")","v":""},{"$f":"IF(OR($F41=\"None\",$F41=\"\"),\"\",\"Yes          No         Unknown\")","v":""}]

{"sheet":"Supplement Page 6","index":16,"n_rows":41,"n_cols":12,"rows_kept":41,"cut":false,"hidden":false,"merged":[[40,9,43,9],[40,10,43,10],[40,11,43,11],[42,1,43,1],[42,2,43,2],[42,4,43,4],[40,1,41,1],[40,2,41,2],[40,4,41,4],[40,5,43,5],[40,7,43,7],[40,8,43,8],[36,9,39,9],[36,10,39,10],[36,11,39,11],[38,1,39,1],[38,2,39,2],[38,4,39,4],[36,1,37,1],[36,2,37,2],[36,4,37,4],[36,5,39,5],[36,7,39,7],[36,8,39,8],[32,9,35,9],[32,10,35,10],[32,11,35,11],[34,1,35,1],[34,2,35,2],[34,4,35,4],[32,1,33,1],[32,2,33,2],[32,4,33,4],[32,5,35,5],[32,7,35,7],[32,8,35,8],[28,9,31,9],[28,10,31,10],[28,11,31,11],[30,1,31,1],[30,2,31,2],[30,4,31,4],[28,1,29,1],[28,2,29,2],[28,4,29,4],[28,5,31,5],[28,7,31,7],[28,8,31,8],[24,9,27,9],[24,10,27,10],[24,11,27,11],[26,1,27,1],[26,2,27,2],[26,4,27,4],[24,1,25,1],[24,2,25,2],[24,4,25,4],[24,5,27,5],[24,7,27,7],[24,8,27,8],[20,9,23,9],[20,10,23,10],[20,11,23,11],[22,1,23,1],[22,2,23,2],[22,4,23,4],[20,1,21,1],[20,2,21,2],[20,4,21,4],[20,5,23,5],[20,7,23,7],[20,8,23,8],[16,9,19,9],[16,10,19,10],[16,11,19,11],[18,1,19,1],[18,2,19,2],[18,4,19,4],[16,1,17,1],[16,2,17,2],[16,4,17,4],[16,5,19,5],[16,7,19,7],[16,8,19,8],[12,9,15,9],[12,10,15,10],[12,11,15,11],[14,1,15,1],[14,2,15,2],[14,4,15,4],[12,1,13,1],[12,2,13,2],[12,4,13,4],[12,5,15,5],[12,7,15,7],[12,8,15,8],[8,9,11,9],[8,10,11,10],[8,11,11,11],[10,1,11,1],[10,2,11,2],[10,4,11,4],[8,1,9,1],[8,2,9,2],[8,4,9,4],[8,5,11,5],[8,7,11,7],[8,8,11,8],[1,1,1,10],[2,5,2,6],[2,7,2,9],[2,10,3,10],[2,11,3,11],[3,5,3,6],[4,9,7,9],[4,10,7,10],[4,11,7,11],[6,1,7,1],[6,2,7,2],[6,4,7,4],[4,1,5,1],[4,2,5,2],[4,4,5,4],[4,5,7,5],[4,7,7,7],[4,8,7,8]]}
[]
[null,"             Interviewer Note: List Company Name, Plant Name, Physical Address, Mailing Address, Contact, Telephone, and Dairy Products Produced for each location."]
[null,"Office Use","Company Name","Physical Address","Contact Name","List ALL Dairy Products                                                             Produced at Plant",null,"Question Answer Log                    (For plants with reportable products, answer questions in the boxes below)",null,null,"Check Box if Plant has Reportable Product",{"$f":"IF(Sheet1!P2=\"\",\"Check Box if plant is/should be reporting weekly by the contact listed on page 1 of 8\",\"Check Box if plant is/should be reporting weekly by the contact listed on page 1 of 8 (\"&Sheet1!P2&\")\")","v":"Check Box if plant is/should be reporting weekly by the contact listed on page 1 of 8"}]
[null,"Plant Id","Plant Name","Mailing Address","Telephone Number","(Check the box ONLY if ALL PRODUCTS LISTED are NOT REPORTABLE)",null,"Question 2","Question 3","Question 4"]
[null,"P44",null,null,null,null,null,{"$f":"IF(OR($F5=\"None\",$F5=\"\"),\"\",\"Yes          No         Unknown\")","v":""},{"$f":"IF(OR($F5=\"None\",$F5=\"\"),\"\",\"Yes          No         Unknown\")","v":""},{"$f":"IF(OR($F5=\"None\",$F5=\"\"),\"\",\"Yes          No         Unknown\")","v":""}]
[]
[]
[]
[null,"P45",null,null,null,null,null,{"$f":"IF(OR($F9=\"None\",$F9=\"\"),\"\",\"Yes          No         Unknown\")","v":""},{"$f":"IF(OR($F9=\"None\",$F9=\"\"),\"\",\"Yes          No         Unknown\")","v":""},{"$f":"IF(OR($F9=\"None\",$F9=\"\"),\"\",\"Yes          No         Unknown\")","v":""}]
[]
[]
[]
[null,"P46",null,null,null,null,null,{"$f":"IF(OR($F13=\"None\",$F13=\"\"),\"\",\"Yes          No         Unknown\")","v":""},{"$f":"IF(OR($F13=\"None\",$F13=\"\"),\"\",\"Yes          No         Unknown\")","v":""},{"$f":"IF(OR($F13=\"None\",$F13=\"\"),\"\",\"Yes          No         Unknown\")","v":""}]
[]
[]
[]
[null,"P47",null,null,null,null,null,{"$f":"IF(OR($F17=\"None\",$F17=\"\"),\"\",\"Yes          No         Unknown\")","v":""},{"$f":"IF(OR($F17=\"None\",$F17=\"\"),\"\",\"Yes          No         Unknown\")","v":""},{"$f":"IF(OR($F17=\"None\",$F17=\"\"),\"\",\"Yes          No         Unknown\")","v":""}]
[]
[]
[]
[null,"P48",null,null,null,null,null,{"$f":"IF(OR($F21=\"None\",$F21=\"\"),\"\",\"Yes          No         Unknown\")","v":""},{"$f":"IF(OR($F21=\"None\",$F21=\"\"),\"\",\"Yes          No         Unknown\")","v":""},{"$f":"IF(OR($F21=\"None\",$F21=\"\"),\"\",\"Yes          No         Unknown\")","v":""}]
[]
[]
[]
[null,"P49",null,null,null,null,null,{"$f":"IF(OR($F25=\"None\",$F25=\"\"),\"\",\"Yes          No         Unknown\")","v":""},{"$f":"IF(OR($F25=\"None\",$F25=\"\"),\"\",\"Yes          No         Unknown\")","v":""},{"$f":"IF(OR($F25=\"None\",$F25=\"\"),\"\",\"Yes          No         Unknown\")","v":""}]
[]
[]
[]
[null,"P50",null,null,null,null,null,{"$f":"IF(OR($F29=\"None\",$F29=\"\"),\"\",\"Yes          No         Unknown\")","v":""},{"$f":"IF(OR($F29=\"None\",$F29=\"\"),\"\",\"Yes          No         Unknown\")","v":""},{"$f":"IF(OR($F29=\"None\",$F29=\"\"),\"\",\"Yes          No         Unknown\")","v":""}]
[]
[]
[]
[null,"P51",null,null,null,null,null,{"$f":"IF(OR($F33=\"None\",$F33=\"\"),\"\",\"Yes          No         Unknown\")","v":""},{"$f":"IF(OR($F33=\"None\",$F33=\"\"),\"\",\"Yes          No         Unknown\")","v":""},{"$f":"IF(OR($F33=\"None\",$F33=\"\"),\"\",\"Yes          No         Unknown\")","v":""}]
[]
[]
[]
[null,"P52",null,null,null,null,null,{"$f":"IF(OR($F37=\"None\",$F37=\"\"),\"\",\"Yes          No         Unknown\")","v":""},{"$f":"IF(OR($F37=\"None\",$F37=\"\"),\"\",\"Yes          No         Unknown\")","v":""},{"$f":"IF(OR($F37=\"None\",$F37=\"\"),\"\",\"Yes          No         Unknown\")","v":""}]
[]
[]
[]
[null,"P53",null,null,null,null,null,{"$f":"IF(OR($F41=\"None\",$F41=\"\"),\"\",\"Yes          No         Unknown\")","v":""},{"$f":"IF(OR($F41=\"None\",$F41=\"\"),\"\",\"Yes          No         Unknown\")","v":""},{"$f":"IF(OR($F41=\"None\",$F41=\"\"),\"\",\"Yes          No         Unknown\")","v":""}]

{"sheet":"Supplement Page 7","index":17,"n_rows":41,"n_cols":12,"rows_kept":41,"cut":false,"hidden":false,"merged":[[40,9,43,9],[40,10,43,10],[40,11,43,11],[42,1,43,1],[42,2,43,2],[42,4,43,4],[40,1,41,1],[40,2,41,2],[40,4,41,4],[40,5,43,5],[40,7,43,7],[40,8,43,8],[36,9,39,9],[36,10,39,10],[36,11,39,11],[38,1,39,1],[38,2,39,2],[38,4,39,4],[36,1,37,1],[36,2,37,2],[36,4,37,4],[36,5,39,5],[36,7,39,7],[36,8,39,8],[32,9,35,9],[32,10,35,10],[32,11,35,11],[34,1,35,1],[34,2,35,2],[34,4,35,4],[32,1,33,1],[32,2,33,2],[32,4,33,4],[32,5,35,5],[32,7,35,7],[32,8,35,8],[28,9,31,9],[28,10,31,10],[28,11,31,11],[30,1,31,1],[30,2,31,2],[30,4,31,4],[28,1,29,1],[28,2,29,2],[28,4,29,4],[28,5,31,5],[28,7,31,7],[28,8,31,8],[24,9,27,9],[24,10,27,10],[24,11,27,11],[26,1,27,1],[26,2,27,2],[26,4,27,4],[24,1,25,1],[24,2,25,2],[24,4,25,4],[24,5,27,5],[24,7,27,7],[24,8,27,8],[20,9,23,9],[20,10,23,10],[20,11,23,11],[22,1,23,1],[22,2,23,2],[22,4,23,4],[20,1,21,1],[20,2,21,2],[20,4,21,4],[20,5,23,5],[20,7,23,7],[20,8,23,8],[16,9,19,9],[16,10,19,10],[16,11,19,11],[18,1,19,1],[18,2,19,2],[18,4,19,4],[16,1,17,1],[16,2,17,2],[16,4,17,4],[16,5,19,5],[16,7,19,7],[16,8,19,8],[12,9,15,9],[12,10,15,10],[12,11,15,11],[14,1,15,1],[14,2,15,2],[14,4,15,4],[12,1,13,1],[12,2,13,2],[12,4,13,4],[12,5,15,5],[12,7,15,7],[12,8,15,8],[8,9,11,9],[8,10,11,10],[8,11,11,11],[10,1,11,1],[10,2,11,2],[10,4,11,4],[8,1,9,1],[8,2,9,2],[8,4,9,4],[8,5,11,5],[8,7,11,7],[8,8,11,8],[1,1,1,10],[2,5,2,6],[2,7,2,9],[2,10,3,10],[2,11,3,11],[3,5,3,6],[4,9,7,9],[4,10,7,10],[4,11,7,11],[6,1,7,1],[6,2,7,2],[6,4,7,4],[4,1,5,1],[4,2,5,2],[4,4,5,4],[4,5,7,5],[4,7,7,7],[4,8,7,8]]}
[]
[null,"             Interviewer Note: List Company Name, Plant Name, Physical Address, Mailing Address, Contact, Telephone, and Dairy Products Produced for each location."]
[null,"Office Use","Company Name","Physical Address","Contact Name","List ALL Dairy Products                                                             Produced at Plant",null,"Question Answer Log                    (For plants with reportable products, answer questions in the boxes below)",null,null,"Check Box if Plant has Reportable Product",{"$f":"IF(Sheet1!P2=\"\",\"Check Box if plant is/should be reporting weekly by the contact listed on page 1 of 8\",\"Check Box if plant is/should be reporting weekly by the contact listed on page 1 of 8 (\"&Sheet1!P2&\")\")","v":"Check Box if plant is/should be reporting weekly by the contact listed on page 1 of 8"}]
[null,"Plant Id","Plant Name","Mailing Address","Telephone Number","(Check the box ONLY if ALL PRODUCTS LISTED are NOT REPORTABLE)",null,"Question 2","Question 3","Question 4"]
[null,"P54",null,null,null,null,null,{"$f":"IF(OR($F5=\"None\",$F5=\"\"),\"\",\"Yes          No         Unknown\")","v":""},{"$f":"IF(OR($F5=\"None\",$F5=\"\"),\"\",\"Yes          No         Unknown\")","v":""},{"$f":"IF(OR($F5=\"None\",$F5=\"\"),\"\",\"Yes          No         Unknown\")","v":""}]
[]
[]
[]
[null,"P55",null,null,null,null,null,{"$f":"IF(OR($F9=\"None\",$F9=\"\"),\"\",\"Yes          No         Unknown\")","v":""},{"$f":"IF(OR($F9=\"None\",$F9=\"\"),\"\",\"Yes          No         Unknown\")","v":""},{"$f":"IF(OR($F9=\"None\",$F9=\"\"),\"\",\"Yes          No         Unknown\")","v":""}]
[]
[]
[]
[null,"P56",null,null,null,null,null,{"$f":"IF(OR($F13=\"None\",$F13=\"\"),\"\",\"Yes          No         Unknown\")","v":""},{"$f":"IF(OR($F13=\"None\",$F13=\"\"),\"\",\"Yes          No         Unknown\")","v":""},{"$f":"IF(OR($F13=\"None\",$F13=\"\"),\"\",\"Yes          No         Unknown\")","v":""}]
[]
[]
[]
[null,"P57",null,null,null,null,null,{"$f":"IF(OR($F17=\"None\",$F17=\"\"),\"\",\"Yes          No         Unknown\")","v":""},{"$f":"IF(OR($F17=\"None\",$F17=\"\"),\"\",\"Yes          No         Unknown\")","v":""},{"$f":"IF(OR($F17=\"None\",$F17=\"\"),\"\",\"Yes          No         Unknown\")","v":""}]
[]
[]
[]
[null,"P58",null,null,null,null,null,{"$f":"IF(OR($F21=\"None\",$F21=\"\"),\"\",\"Yes          No         Unknown\")","v":""},{"$f":"IF(OR($F21=\"None\",$F21=\"\"),\"\",\"Yes          No         Unknown\")","v":""},{"$f":"IF(OR($F21=\"None\",$F21=\"\"),\"\",\"Yes          No         Unknown\")","v":""}]
[]
[]
[]
[null,"P59",null,null,null,null,null,{"$f":"IF(OR($F25=\"None\",$F25=\"\"),\"\",\"Yes          No         Unknown\")","v":""},{"$f":"IF(OR($F25=\"None\",$F25=\"\"),\"\",\"Yes          No         Unknown\")","v":""},{"$f":"IF(OR($F25=\"None\",$F25=\"\"),\"\",\"Yes          No         Unknown\")","v":""}]
[]
[]
[]
[null,"P60",null,null,null,null,null,{"$f":"IF(OR($F29=\"None\",$F29=\"\"),\"\",\"Yes          No         Unknown\")","v":""},{"$f":"IF(OR($F29=\"None\",$F29=\"\"),\"\",\"Yes          No         Unknown\")","v":""},{"$f":"IF(OR($F29=\"None\",$F29=\"\"),\"\",\"Yes          No         Unknown\")","v":""}]
[]
[]
[]
[null,"P61",null,null,null,null,null,{"$f":"IF(OR($F33=\"None\",$F33=\"\"),\"\",\"Yes          No         Unknown\")","v":""},{"$f":"IF(OR($F33=\"None\",$F33=\"\"),\"\",\"Yes          No         Unknown\")","v":""},{"$f":"IF(OR($F33=\"None\",$F33=\"\"),\"\",\"Yes          No         Unknown\")","v":""}]
[]
[]
[]
[null,"P62",null,null,null,null,null,{"$f":"IF(OR($F37=\"None\",$F37=\"\"),\"\",\"Yes          No         Unknown\")","v":""},{"$f":"IF(OR($F37=\"None\",$F37=\"\"),\"\",\"Yes          No         Unknown\")","v":""},{"$f":"IF(OR($F37=\"None\",$F37=\"\"),\"\",\"Yes          No         Unknown\")","v":""}]
[]
[]
[]
[null,"P63",null,null,null,null,null,{"$f":"IF(OR($F41=\"None\",$F41=\"\"),\"\",\"Yes          No         Unknown\")","v":""},{"$f":"IF(OR($F41=\"None\",$F41=\"\"),\"\",\"Yes          No         Unknown\")","v":""},{"$f":"IF(OR($F41=\"None\",$F41=\"\"),\"\",\"Yes          No         Unknown\")","v":""}]

{"sheet":"Supplement Page 8","index":18,"n_rows":41,"n_cols":12,"rows_kept":41,"cut":false,"hidden":false,"merged":[[40,9,43,9],[40,10,43,10],[40,11,43,11],[42,1,43,1],[42,2,43,2],[42,4,43,4],[40,1,41,1],[40,2,41,2],[40,4,41,4],[40,5,43,5],[40,7,43,7],[40,8,43,8],[36,9,39,9],[36,10,39,10],[36,11,39,11],[38,1,39,1],[38,2,39,2],[38,4,39,4],[36,1,37,1],[36,2,37,2],[36,4,37,4],[36,5,39,5],[36,7,39,7],[36,8,39,8],[32,9,35,9],[32,10,35,10],[32,11,35,11],[34,1,35,1],[34,2,35,2],[34,4,35,4],[32,1,33,1],[32,2,33,2],[32,4,33,4],[32,5,35,5],[32,7,35,7],[32,8,35,8],[28,9,31,9],[28,10,31,10],[28,11,31,11],[30,1,31,1],[30,2,31,2],[30,4,31,4],[28,1,29,1],[28,2,29,2],[28,4,29,4],[28,5,31,5],[28,7,31,7],[28,8,31,8],[24,9,27,9],[24,10,27,10],[24,11,27,11],[26,1,27,1],[26,2,27,2],[26,4,27,4],[24,1,25,1],[24,2,25,2],[24,4,25,4],[24,5,27,5],[24,7,27,7],[24,8,27,8],[20,9,23,9],[20,10,23,10],[20,11,23,11],[22,1,23,1],[22,2,23,2],[22,4,23,4],[20,1,21,1],[20,2,21,2],[20,4,21,4],[20,5,23,5],[20,7,23,7],[20,8,23,8],[16,9,19,9],[16,10,19,10],[16,11,19,11],[18,1,19,1],[18,2,19,2],[18,4,19,4],[16,1,17,1],[16,2,17,2],[16,4,17,4],[16,5,19,5],[16,7,19,7],[16,8,19,8],[12,9,15,9],[12,10,15,10],[12,11,15,11],[14,1,15,1],[14,2,15,2],[14,4,15,4],[12,1,13,1],[12,2,13,2],[12,4,13,4],[12,5,15,5],[12,7,15,7],[12,8,15,8],[8,9,11,9],[8,10,11,10],[8,11,11,11],[10,1,11,1],[10,2,11,2],[10,4,11,4],[8,1,9,1],[8,2,9,2],[8,4,9,4],[8,5,11,5],[8,7,11,7],[8,8,11,8],[1,1,1,10],[2,5,2,6],[2,7,2,9],[2,10,3,10],[2,11,3,11],[3,5,3,6],[4,9,7,9],[4,10,7,10],[4,11,7,11],[6,1,7,1],[6,2,7,2],[6,4,7,4],[4,1,5,1],[4,2,5,2],[4,4,5,4],[4,5,7,5],[4,7,7,7],[4,8,7,8]]}
[]
[null,"             Interviewer Note: List Company Name, Plant Name, Physical Address, Mailing Address, Contact, Telephone, and Dairy Products Produced for each location."]
[null,"Office Use","Company Name","Physical Address","Contact Name","List ALL Dairy Products                                                             Produced at Plant",null,"Question Answer Log                    (For plants with reportable products, answer questions in the boxes below)",null,null,"Check Box if Plant has Reportable Product",{"$f":"IF(Sheet1!P2=\"\",\"Check Box if plant is/should be reporting weekly by the contact listed on page 1 of 8\",\"Check Box if plant is/should be reporting weekly by the contact listed on page 1 of 8 (\"&Sheet1!P2&\")\")","v":"Check Box if plant is/should be reporting weekly by the contact listed on page 1 of 8"}]
[null,"Plant Id","Plant Name","Mailing Address","Telephone Number","(Check the box ONLY if ALL PRODUCTS LISTED are NOT REPORTABLE)",null,"Question 2","Question 3","Question 4"]
[null,"P64",null,null,null,null,null,{"$f":"IF(OR($F5=\"None\",$F5=\"\"),\"\",\"Yes          No         Unknown\")","v":""},{"$f":"IF(OR($F5=\"None\",$F5=\"\"),\"\",\"Yes          No         Unknown\")","v":""},{"$f":"IF(OR($F5=\"None\",$F5=\"\"),\"\",\"Yes          No         Unknown\")","v":""}]
[]
[]
[]
[null,"P65",null,null,null,null,null,{"$f":"IF(OR($F9=\"None\",$F9=\"\"),\"\",\"Yes          No         Unknown\")","v":""},{"$f":"IF(OR($F9=\"None\",$F9=\"\"),\"\",\"Yes          No         Unknown\")","v":""},{"$f":"IF(OR($F9=\"None\",$F9=\"\"),\"\",\"Yes          No         Unknown\")","v":""}]
[]
[]
[]
[null,"P66",null,null,null,null,null,{"$f":"IF(OR($F13=\"None\",$F13=\"\"),\"\",\"Yes          No         Unknown\")","v":""},{"$f":"IF(OR($F13=\"None\",$F13=\"\"),\"\",\"Yes          No         Unknown\")","v":""},{"$f":"IF(OR($F13=\"None\",$F13=\"\"),\"\",\"Yes          No         Unknown\")","v":""}]
[]
[]
[]
[null,"P67",null,null,null,null,null,{"$f":"IF(OR($F17=\"None\",$F17=\"\"),\"\",\"Yes          No         Unknown\")","v":""},{"$f":"IF(OR($F17=\"None\",$F17=\"\"),\"\",\"Yes          No         Unknown\")","v":""},{"$f":"IF(OR($F17=\"None\",$F17=\"\"),\"\",\"Yes          No         Unknown\")","v":""}]
[]
[]
[]
[null,"P68",null,null,null,null,null,{"$f":"IF(OR($F21=\"None\",$F21=\"\"),\"\",\"Yes          No         Unknown\")","v":""},{"$f":"IF(OR($F21=\"None\",$F21=\"\"),\"\",\"Yes          No         Unknown\")","v":""},{"$f":"IF(OR($F21=\"None\",$F21=\"\"),\"\",\"Yes          No         Unknown\")","v":""}]
[]
[]
[]
[null,"P69",null,null,null,null,null,{"$f":"IF(OR($F25=\"None\",$F25=\"\"),\"\",\"Yes          No         Unknown\")","v":""},{"$f":"IF(OR($F25=\"None\",$F25=\"\"),\"\",\"Yes          No         Unknown\")","v":""},{"$f":"IF(OR($F25=\"None\",$F25=\"\"),\"\",\"Yes          No         Unknown\")","v":""}]
[]
[]
[]
[null,"P70",null,null,null,null,null,{"$f":"IF(OR($F29=\"None\",$F29=\"\"),\"\",\"Yes          No         Unknown\")","v":""},{"$f":"IF(OR($F29=\"None\",$F29=\"\"),\"\",\"Yes          No         Unknown\")","v":""},{"$f":"IF(OR($F29=\"None\",$F29=\"\"),\"\",\"Yes          No         Unknown\")","v":""}]
[]
[]
[]
[null,"P71",null,null,null,null,null,{"$f":"IF(OR($F33=\"None\",$F33=\"\"),\"\",\"Yes          No         Unknown\")","v":""},{"$f":"IF(OR($F33=\"None\",$F33=\"\"),\"\",\"Yes          No         Unknown\")","v":""},{"$f":"IF(OR($F33=\"None\",$F33=\"\"),\"\",\"Yes          No         Unknown\")","v":""}]
[]
[]
[]
[null,"P72",null,null,null,null,null,{"$f":"IF(OR($F37=\"None\",$F37=\"\"),\"\",\"Yes          No         Unknown\")","v":""},{"$f":"IF(OR($F37=\"None\",$F37=\"\"),\"\",\"Yes          No         Unknown\")","v":""},{"$f":"IF(OR($F37=\"None\",$F37=\"\"),\"\",\"Yes          No         Unknown\")","v":""}]
[]
[]
[]
[null,"P73",null,null,null,null,null,{"$f":"IF(OR($F41=\"None\",$F41=\"\"),\"\",\"Yes          No         Unknown\")","v":""},{"$f":"IF(OR($F41=\"None\",$F41=\"\"),\"\",\"Yes          No         Unknown\")","v":""},{"$f":"IF(OR($F41=\"None\",$F41=\"\"),\"\",\"Yes          No         Unknown\")","v":""}]

{"sheet":"Supplement Page 7b","index":19,"n_rows":42,"n_cols":10,"rows_kept":42,"cut":false,"hidden":true,"merged":[[41,7,44,7],[41,8,44,8],[41,9,44,9],[43,1,44,1],[43,2,44,2],[43,4,44,4],[37,8,40,8],[37,9,40,9],[39,1,40,1],[39,2,40,2],[39,4,40,4],[41,1,42,1],[41,2,42,2],[41,4,42,4],[41,5,44,5],[41,6,44,6],[37,1,38,1],[37,2,38,2],[37,4,38,4],[37,5,40,5],[37,6,40,6],[37,7,40,7],[33,7,36,7],[33,8,36,8],[33,9,36,9],[35,1,36,1],[35,2,36,2],[35,4,36,4],[29,8,32,8],[29,9,32,9],[31,1,32,1],[31,2,32,2],[31,4,32,4],[33,1,34,1],[33,2,34,2],[33,4,34,4],[33,5,36,5],[33,6,36,6],[29,1,30,1],[29,2,30,2],[29,4,30,4],[29,5,32,5],[29,6,32,6],[29,7,32,7],[25,7,28,7],[25,8,28,8],[25,9,28,9],[27,1,28,1],[27,2,28,2],[27,4,28,4],[21,8,24,8],[21,9,24,9],[23,1,24,1],[23,2,24,2],[23,4,24,4],[25,1,26,1],[25,2,26,2],[25,4,26,4],[25,5,28,5],[25,6,28,6],[21,1,22,1],[21,2,22,2],[21,4,22,4],[21,5,24,5],[21,6,24,6],[21,7,24,7],[17,7,20,7],[17,8,20,8],[17,9,20,9],[19,1,20,1],[19,2,20,2],[19,4,20,4],[13,8,16,8],[13,9,16,9],[15,1,16,1],[15,2,16,2],[15,4,16,4],[17,1,18,1],[17,2,18,2],[17,4,18,4],[17,5,20,5],[17,6,20,6],[13,1,14,1],[13,2,14,2],[13,4,14,4],[13,5,16,5],[13,6,16,6],[13,7,16,7],[9,7,12,7],[9,8,12,8],[9,9,12,9],[11,1,12,1],[11,2,12,2],[11,4,12,4],[5,8,8,8],[5,9,8,9],[7,1,8,1],[7,2,8,2],[7,4,8,4],[9,1,10,1],[9,2,10,2],[9,4,10,4],[9,5,12,5],[9,6,12,6],[1,2,2,7],[3,5,4,5],[3,6,3,8],[3,9,4,9],[5,1,6,1],[5,2,6,2],[5,4,6,4],[5,5,8,5],[5,6,8,6],[5,7,8,7]]}
[]
[null,null,"Interviewer Note: List Company Name, Plant Name, Physical Address, Mailing Address, Contact, Telephone, and Dairy Products Produced for each location."]
[]
[null,"Office Use","Company Name","Physical Address","Contact Name","Products                                                             Produced","Question Answer Log",null,null,"Check Box if Plant has Reportable Product"]
[null,"Plant Id","Plant Name","Mailing Address","Telephone Number",null,"Q - 2","Q - 3","Q - 4"]
[null,"P54"]
[]
[]
[]
[null,"P55"]
[]
[]
[]
[null,"P56"]
[]
[]
[]
[null,"P57"]
[]
[]
[]
[null,"P58"]
[]
[]
[]
[null,"P59"]
[]
[]
[]
[null,"P60"]
[]
[]
[]
[null,"P61"]
[]
[]
[]
[null,"P62"]
[]
[]
[]
[null,"P63"]

{"sheet":"Supplement Page 8b","index":20,"n_rows":42,"n_cols":10,"rows_kept":42,"cut":false,"hidden":true,"merged":[[1,2,2,7],[3,5,4,5],[3,6,3,8],[3,9,4,9],[5,1,6,1],[5,2,6,2],[5,4,6,4],[5,5,8,5],[5,6,8,6],[5,7,8,7],[9,7,12,7],[9,8,12,8],[9,9,12,9],[11,1,12,1],[11,2,12,2],[11,4,12,4],[5,8,8,8],[5,9,8,9],[7,1,8,1],[7,2,8,2],[7,4,8,4],[9,1,10,1],[9,2,10,2],[9,4,10,4],[9,5,12,5],[9,6,12,6],[17,7,20,7],[17,8,20,8],[17,9,20,9],[19,1,20,1],[19,2,20,2],[19,4,20,4],[13,8,16,8],[13,9,16,9],[15,1,16,1],[15,2,16,2],[15,4,16,4],[17,1,18,1],[17,2,18,2],[17,4,18,4],[17,5,20,5],[17,6,20,6],[13,1,14,1],[13,2,14,2],[13,4,14,4],[13,5,16,5],[13,6,16,6],[13,7,16,7],[25,7,28,7],[25,8,28,8],[25,9,28,9],[27,1,28,1],[27,2,28,2],[27,4,28,4],[21,8,24,8],[21,9,24,9],[23,1,24,1],[23,2,24,2],[23,4,24,4],[25,1,26,1],[25,2,26,2],[25,4,26,4],[25,5,28,5],[25,6,28,6],[21,1,22,1],[21,2,22,2],[21,4,22,4],[21,5,24,5],[21,6,24,6],[21,7,24,7],[33,7,36,7],[33,8,36,8],[33,9,36,9],[35,1,36,1],[35,2,36,2],[35,4,36,4],[29,8,32,8],[29,9,32,9],[31,1,32,1],[31,2,32,2],[31,4,32,4],[33,1,34,1],[33,2,34,2],[33,4,34,4],[33,5,36,5],[33,6,36,6],[29,1,30,1],[29,2,30,2],[29,4,30,4],[29,5,32,5],[29,6,32,6],[29,7,32,7],[41,7,44,7],[41,8,44,8],[41,9,44,9],[43,1,44,1],[43,2,44,2],[43,4,44,4],[37,8,40,8],[37,9,40,9],[39,1,40,1],[39,2,40,2],[39,4,40,4],[41,1,42,1],[41,2,42,2],[41,4,42,4],[41,5,44,5],[41,6,44,6],[37,1,38,1],[37,2,38,2],[37,4,38,4],[37,5,40,5],[37,6,40,6],[37,7,40,7]]}
[]
[null,null,"Interviewer Note: List Company Name, Plant Name, Physical Address, Mailing Address, Contact, Telephone, and Dairy Products Produced for each location."]
[]
[null,"Office Use","Company Name","Physical Address","Contact Name","Products                                                             Produced","Question Answer Log",null,null,"Check Box if Plant has Reportable Product"]
[null,"Plant Id","Plant Name","Mailing Address","Telephone Number",null,"Q - 2","Q - 3","Q - 4"]
[null,"P64"]
[]
[]
[]
[null,"P65"]
[]
[]
[]
[null,"P66"]
[]
[]
[]
[null,"P67"]
[]
[]
[]
[null,"P68"]
[]
[]
[]
[null,"P69"]
[]
[]
[]
[null,"P70"]
[]
[]
[]
[null,"P71"]
[]
[]
[]
[null,"P72"]
[]
[]
[]
[null,"P73"]

{"sheet":"Sheet1","index":21,"n_rows":75,"n_cols":16,"rows_kept":75,"cut":false,"hidden":true,"merged":[]}
["ID","Plant","Location",null,"True/False","ID","Plant","Location","HQ","Currently Reporting Check","ID","Plant","Location","Reportable Product",null,"Contact name from page 1 of 8"]
[null,null,null,null,null,null,null,null,"HQ",false,{"$f":"IF(J2=TRUE,IF('Supplement Page 1 of 3'!B14=\"\",\"\",'Supplement Page 1 of 3'!B14),\"\")","v":""},{"$f":"IF($J2=TRUE,IF('Supplement Page 1 of 3'!C14=\"\",\"\",'Supplement Page 1 of 3'!C14),\"\")","v":""},{"$f":"IF(J2=TRUE,IF('Supplement Page 1 of 3'!D13=\"\",\"\",LEFT('Supplement Page 1 of 3'!D13,LEN('Supplement Page 1 of 3'!D13)-6)),\"\")","v":""},false,null,{"$f":"IF('Page 1 of 8'!E8=\"\",\"\",'Page 1 of 8'!E8)","v":""}]
[null,null,null,null,null,null,null,null,null,false,{"$f":"IF(J3=TRUE,IF('Supplement Page 1 of 3'!B18=\"\",\"\",'Supplement Page 1 of 3'!B18),\"\")","v":""},{"$f":"IF($J3=TRUE,IF('Supplement Page 1 of 3'!C18=\"\",\"\",'Supplement Page 1 of 3'!C18),\"\")","v":""},{"$f":"IF(J3=TRUE,IF('Supplement Page 1 of 3'!D17=\"\",\"\",LEFT('Supplement Page 1 of 3'!D17,LEN('Supplement Page 1 of 3'!D17)-6)),\"\")","v":""},false]
[null,null,null,null,null,null,null,null,null,false,{"$f":"IF(J4=TRUE,IF('Supplement Page 1 of 3'!B22=\"\",\"\",'Supplement Page 1 of 3'!B22),\"\")","v":""},{"$f":"IF($J4=TRUE,IF('Supplement Page 1 of 3'!C22=\"\",\"\",'Supplement Page 1 of 3'!C22),\"\")","v":""},{"$f":"IF(J4=TRUE,IF('Supplement Page 1 of 3'!D21=\"\",\"\",LEFT('Supplement Page 1 of 3'!D21,LEN('Supplement Page 1 of 3'!D21)-6)),\"\")","v":""},false]
[null,null,null,null,null,null,null,null,null,false,{"$f":"IF(J5=TRUE,IF('Supplement Page 1 of 3'!B26=\"\",\"\",'Supplement Page 1 of 3'!B26),\"\")","v":""},{"$f":"IF($J5=TRUE,IF('Supplement Page 1 of 3'!C26=\"\",\"\",'Supplement Page 1 of 3'!C26),\"\")","v":""},{"$f":"IF(J5=TRUE,IF('Supplement Page 1 of 3'!D25=\"\",\"\",LEFT('Supplement Page 1 of 3'!D25,LEN('Supplement Page 1 of 3'!D25)-6)),\"\")","v":""},false]
[null,null,null,null,null,null,null,null,null,false,{"$f":"IF($J6=TRUE,IF('Supplement Page 2 of 3'!B7=\"\",\"\",'Supplement Page 2 of 3'!B7),\"\")","v":""},{"$f":"IF($J6=TRUE,IF('Supplement Page 2 of 3'!C7=\"\",\"\",'Supplement Page 2 of 3'!C7),\"\")","v":""},{"$f":"IF(J6=TRUE,IF('Supplement Page 2 of 3'!D6=\"\",\"\",LEFT('Supplement Page 2 of 3'!D6,LEN('Supplement Page 2 of 3'!D6)-6)),\"\")","v":""},false]
[null,null,null,null,null,null,null,null,null,false,{"$f":"IF($J7=TRUE,IF('Supplement Page 2 of 3'!B11=\"\",\"\",'Supplement Page 2 of 3'!B11),\"\")","v":""},{"$f":"IF($J7=TRUE,IF('Supplement Page 2 of 3'!C11=\"\",\"\",'Supplement Page 2 of 3'!C11),\"\")","v":""},{"$f":"IF(J7=TRUE,IF('Supplement Page 2 of 3'!D10=\"\",\"\",LEFT('Supplement Page 2 of 3'!D10,LEN('Supplement Page 2 of 3'!D10)-6)),\"\")","v":""},false]
[null,null,null,null,null,null,null,null,null,false,{"$f":"IF($J8=TRUE,IF('Supplement Page 2 of 3'!B15=\"\",\"\",'Supplement Page 2 of 3'!B15),\"\")","v":""},{"$f":"IF($J8=TRUE,IF('Supplement Page 2 of 3'!C15=\"\",\"\",'Supplement Page 2 of 3'!C15),\"\")","v":""},{"$f":"IF(J8=TRUE,IF('Supplement Page 2 of 3'!D14=\"\",\"\",LEFT('Supplement Page 2 of 3'!D14,LEN('Supplement Page 2 of 3'!D14)-6)),\"\")","v":""},false]
[null,null,null,null,null,null,null,null,null,false,{"$f":"IF($J9=TRUE,IF('Supplement Page 2 of 3'!B19=\"\",\"\",'Supplement Page 2 of 3'!B19),\"\")","v":""},{"$f":"IF($J9=TRUE,IF('Supplement Page 2 of 3'!C19=\"\",\"\",'Supplement Page 2 of 3'!C19),\"\")","v":""},{"$f":"IF(J9=TRUE,IF('Supplement Page 2 of 3'!D18=\"\",\"\",LEFT('Supplement Page 2 of 3'!D18,LEN('Supplement Page 2 of 3'!D18)-6)),\"\")","v":""},false]
[null,null,null,null,null,null,null,null,null,false,{"$f":"IF($J10=TRUE,IF('Supplement Page 2 of 3'!B23=\"\",\"\",'Supplement Page 2 of 3'!B23),\"\")","v":""},{"$f":"IF($J10=TRUE,IF('Supplement Page 2 of 3'!C23=\"\",\"\",'Supplement Page 2 of 3'!C23),\"\")","v":""},{"$f":"IF(J10=TRUE,IF('Supplement Page 2 of 3'!D22=\"\",\"\",LEFT('Supplement Page 2 of 3'!D22,LEN('Supplement Page 2 of 3'!D22)-6)),\"\")","v":""},false]
[null,null,null,null,null,null,null,null,null,false,{"$f":"IF($J11=TRUE,IF('Supplement Page 2 of 3'!B27=\"\",\"\",'Supplement Page 2 of 3'!B27),\"\")","v":""},{"$f":"IF($J11=TRUE,IF('Supplement Page 2 of 3'!C27=\"\",\"\",'Supplement Page 2 of 3'!C27),\"\")","v":""},{"$f":"IF(J11=TRUE,IF('Supplement Page 2 of 3'!D26=\"\",\"\",LEFT('Supplement Page 2 of 3'!D26,LEN('Supplement Page 2 of 3'!D26)-6)),\"\")","v":""},false]
[null,null,null,null,null,null,null,null,null,false,{"$f":"IF($J12=TRUE,IF('Supplement Page 2 of 3'!B31=\"\",\"\",'Supplement Page 2 of 3'!B31),\"\")","v":""},{"$f":"IF($J12=TRUE,IF('Supplement Page 2 of 3'!C31=\"\",\"\",'Supplement Page 2 of 3'!C31),\"\")","v":""},{"$f":"IF(J12=TRUE,IF('Supplement Page 2 of 3'!D30=\"\",\"\",LEFT('Supplement Page 2 of 3'!D30,LEN('Supplement Page 2 of 3'!D30)-6)),\"\")","v":""},false]
[null,null,null,null,null,null,null,null,null,false,{"$f":"IF($J13=TRUE,IF('Supplement Page 2 of 3'!B35=\"\",\"\",'Supplement Page 2 of 3'!B35),\"\")","v":""},{"$f":"IF($J13=TRUE,IF('Supplement Page 2 of 3'!C35=\"\",\"\",'Supplement Page 2 of 3'!C35),\"\")","v":""},{"$f":"IF(J13=TRUE,IF('Supplement Page 2 of 3'!D34=\"\",\"\",LEFT('Supplement Page 2 of 3'!D34,LEN('Supplement Page 2 of 3'!D34)-6)),\"\")","v":""},false]
[null,null,null,null,null,null,null,null,null,false,{"$f":"IF($J14=TRUE,IF('Supplement Page 2 of 3'!B39=\"\",\"\",'Supplement Page 2 of 3'!B39),\"\")","v":""},{"$f":"IF($J14=TRUE,IF('Supplement Page 2 of 3'!C39=\"\",\"\",'Supplement Page 2 of 3'!C39),\"\")","v":""},{"$f":"IF(J14=TRUE,IF('Supplement Page 2 of 3'!D38=\"\",\"\",LEFT('Supplement Page 2 of 3'!D38,LEN('Supplement Page 2 of 3'!D38)-6)),\"\")","v":""},false]
[null,null,null,null,null,null,null,null,null,false,{"$f":"IF($J15=TRUE,IF('Supplement Page 2 of 3'!B43=\"\",\"\",'Supplement Page 2 of 3'!B43),\"\")","v":""},{"$f":"IF($J15=TRUE,IF('Supplement Page 2 of 3'!C43=\"\",\"\",'Supplement Page 2 of 3'!C43),\"\")","v":""},{"$f":"IF(J15=TRUE,IF('Supplement Page 2 of 3'!D42=\"\",\"\",LEFT('Supplement Page 2 of 3'!D42,LEN('Supplement Page 2 of 3'!D42)-6)),\"\")","v":""},false]
[null,null,null,null,null,null,null,null,null,false,{"$f":"IF($J16=TRUE,IF('Supplement Page 3 of 3'!$B$7=\"\",\"\",'Supplement Page 3 of 3'!$B$7),\"\")","v":""},{"$f":"IF($J16=TRUE,IF('Supplement Page 3 of 3'!$C$7=\"\",\"\",'Supplement Page 3 of 3'!$C$7),\"\")","v":""},{"$f":"IF(J16=TRUE,IF('Supplement Page 3 of 3'!$D$6=\"\",\"\",LEFT('Supplement Page 3 of 3'!$D$6,LEN('Supplement Page 3 of 3'!$D$6)-6)),\"\")","v":""},false]
[null,null,null,null,null,null,null,null,null,false,{"$f":"IF($J17=TRUE,IF('Supplement Page 3 of 3'!$B$11=\"\",\"\",'Supplement Page 3 of 3'!$B$11),\"\")","v":""},{"$f":"IF($J17=TRUE,IF('Supplement Page 3 of 3'!$C$11=\"\",\"\",'Supplement Page 3 of 3'!$C$11),\"\")","v":""},{"$f":"IF(J17=TRUE,IF('Supplement Page 3 of 3'!$D$10=\"\",\"\",LEFT('Supplement Page 3 of 3'!$D$10,LEN('Supplement Page 3 of 3'!$D$10)-6)),\"\")","v":""},false]
[null,null,null,null,null,null,null,null,null,false,{"$f":"IF($J18=TRUE,IF('Supplement Page 3 of 3'!$B$15=\"\",\"\",'Supplement Page 3 of 3'!$B$15),\"\")","v":""},{"$f":"IF($J18=TRUE,IF('Supplement Page 3 of 3'!$C$15=\"\",\"\",'Supplement Page 3 of 3'!$C$15),\"\")","v":""},{"$f":"IF(J18=TRUE,IF('Supplement Page 3 of 3'!$D$14=\"\",\"\",LEFT('Supplement Page 3 of 3'!$D$14,LEN('Supplement Page 3 of 3'!$D$14)-6)),\"\")","v":""},false]
[null,null,null,null,null,null,null,null,null,false,{"$f":"IF($J19=TRUE,IF('Supplement Page 3 of 3'!$B$19=\"\",\"\",'Supplement Page 3 of 3'!$B$19),\"\")","v":""},{"$f":"IF($J19=TRUE,IF('Supplement Page 3 of 3'!$C$19=\"\",\"\",'Supplement Page 3 of 3'!$C$19),\"\")","v":""},{"$f":"IF(J19=TRUE,IF('Supplement Page 3 of 3'!$D$18=\"\",\"\",LEFT('Supplement Page 3 of 3'!$D$18,LEN('Supplement Page 3 of 3'!$D$18)-6)),\"\")","v":""},false]
[null,null,null,null,null,null,null,null,null,false,{"$f":"IF(J20=TRUE,IF('Supplement Page 3 of 3'!$B$23=\"\",\"\",'Supplement Page 3 of 3'!$B$23),\"\")","v":""},{"$f":"IF($J20=TRUE,IF('Supplement Page 3 of 3'!$C$23=\"\",\"\",'Supplement Page 3 of 3'!$C$23),\"\")","v":""},{"$f":"IF(J20=TRUE,IF('Supplement Page 3 of 3'!$D$22=\"\",\"\",LEFT('Supplement Page 3 of 3'!$D$22,LEN('Supplement Page 3 of 3'!$D$22)-6)),\"\")","v":""},false]
[null,null,null,null,null,null,null,null,null,false,{"$f":"IF($J21=TRUE,IF('Supplement Page 3 of 3'!$B$27=\"\",\"\",'Supplement Page 3 of 3'!$B$27),\"\")","v":""},{"$f":"IF($J21=TRUE,IF('Supplement Page 3 of 3'!$C$27=\"\",\"\",'Supplement Page 3 of 3'!$C$27),\"\")","v":""},{"$f":"IF(J21=TRUE,IF('Supplement Page 3 of 3'!$D$26=\"\",\"\",LEFT('Supplement Page 3 of 3'!$D$26,LEN('Supplement Page 3 of 3'!$D$26)-6)),\"\")","v":""},false]
[null,null,null,null,null,null,null,null,null,false,{"$f":"IF($J22=TRUE,IF('Supplement Page 3 of 3'!$B$31=\"\",\"\",'Supplement Page 3 of 3'!$B$31),\"\")","v":""},{"$f":"IF($J22=TRUE,IF('Supplement Page 3 of 3'!$C$31=\"\",\"\",'Supplement Page 3 of 3'!$C$31),\"\")","v":""},{"$f":"IF(J22=TRUE,IF('Supplement Page 3 of 3'!$D$30=\"\",\"\",LEFT('Supplement Page 3 of 3'!$D$30,LEN('Supplement Page 3 of 3'!$D$30)-6)),\"\")","v":""},false]
[null,null,null,null,null,null,null,null,null,false,{"$f":"IF($J23=TRUE,IF('Supplement Page 3 of 3'!$B$35=\"\",\"\",'Supplement Page 3 of 3'!$B$35),\"\")","v":""},{"$f":"IF($J23=TRUE,IF('Supplement Page 3 of 3'!$C$35=\"\",\"\",'Supplement Page 3 of 3'!$C$35),\"\")","v":""},{"$f":"IF(J23=TRUE,IF('Supplement Page 3 of 3'!$D$34=\"\",\"\",LEFT('Supplement Page 3 of 3'!$D$34,LEN('Supplement Page 3 of 3'!$D$34)-6)),\"\")","v":""},false]
[null,null,null,null,null,null,null,null,null,false,{"$f":"IF($J24=TRUE,IF('Supplement Page 3 of 3'!$B$39=\"\",\"\",'Supplement Page 3 of 3'!$B$39),\"\")","v":""},{"$f":"IF($J24=TRUE,IF('Supplement Page 3 of 3'!$C$39=\"\",\"\",'Supplement Page 3 of 3'!$C$39),\"\")","v":""},{"$f":"IF(J24=TRUE,IF('Supplement Page 3 of 3'!$D$38=\"\",\"\",LEFT('Supplement Page 3 of 3'!$D$38,LEN('Supplement Page 3 of 3'!$D$38)-6)),\"\")","v":""},false]
[null,null,null,null,null,null,null,null,null,false,{"$f":"IF($J25=TRUE,IF('Supplement Page 3 of 3'!$B$43=\"\",\"\",'Supplement Page 3 of 3'!$B$43),\"\")","v":""},{"$f":"IF($J25=TRUE,IF('Supplement Page 3 of 3'!$C$43=\"\",\"\",'Supplement Page 3 of 3'!$C$43),\"\")","v":""},{"$f":"IF(J25=TRUE,IF('Supplement Page 3 of 3'!$D$42=\"\",\"\",LEFT('Supplement Page 3 of 3'!$D$42,LEN('Supplement Page 3 of 3'!$D$42)-6)),\"\")","v":""},false]
[null,null,null,null,null,null,null,null,null,false,{"$f":"IF($J26=TRUE,IF('Supplement Page 4'!$B$7=\"\",\"\",'Supplement Page 4'!$B$7),\"\")","v":""},{"$f":"IF($J26=TRUE,IF('Supplement Page 4'!$C$7=\"\",\"\",'Supplement Page 4'!$C$7),\"\")","v":""},{"$f":"IF(J26=TRUE,IF('Supplement Page 4'!$D$6=\"\",\"\",LEFT('Supplement Page 4'!$D$6,LEN('Supplement Page 4'!$D$6)-6)),\"\")","v":""},false]
[null,null,null,null,null,null,null,null,null,false,{"$f":"IF($J27=TRUE,IF('Supplement Page 4'!$B$11=\"\",\"\",'Supplement Page 4'!$B$11),\"\")","v":""},{"$f":"IF($J27=TRUE,IF('Supplement Page 4'!$C$11=\"\",\"\",'Supplement Page 4'!$C$11),\"\")","v":""},{"$f":"IF(J27=TRUE,IF('Supplement Page 4'!$D$10=\"\",\"\",LEFT('Supplement Page 4'!$D$10,LEN('Supplement Page 4'!$D$10)-6)),\"\")","v":""},false]
[null,null,null,null,null,null,null,null,null,false,{"$f":"IF($J28=TRUE,IF('Supplement Page 4'!$B$15=\"\",\"\",'Supplement Page 4'!$B$15),\"\")","v":""},{"$f":"IF($J28=TRUE,IF('Supplement Page 4'!$C$15=\"\",\"\",'Supplement Page 4'!$C$15),\"\")","v":""},{"$f":"IF(J28=TRUE,IF('Supplement Page 4'!$D$14=\"\",\"\",LEFT('Supplement Page 4'!$D$14,LEN('Supplement Page 4'!$D$14)-6)),\"\")","v":""},false]
[null,null,null,null,null,null,null,null,null,false,{"$f":"IF($J29=TRUE,IF('Supplement Page 4'!$B$19=\"\",\"\",'Supplement Page 4'!$B$19),\"\")","v":""},{"$f":"IF($J29=TRUE,IF('Supplement Page 4'!$C$19=\"\",\"\",'Supplement Page 4'!$C$19),\"\")","v":""},{"$f":"IF(J29=TRUE,IF('Supplement Page 4'!$D$18=\"\",\"\",LEFT('Supplement Page 4'!$D$18,LEN('Supplement Page 4'!$D$18)-6)),\"\")","v":""},false]
[null,null,null,null,null,null,null,null,null,false,{"$f":"IF($J30=TRUE,IF('Supplement Page 4'!$B$23=\"\",\"\",'Supplement Page 4'!$B$23),\"\")","v":""},{"$f":"IF($J30=TRUE,IF('Supplement Page 4'!$C$23=\"\",\"\",'Supplement Page 4'!$C$23),\"\")","v":""},{"$f":"IF(J30=TRUE,IF('Supplement Page 4'!$D$22=\"\",\"\",LEFT('Supplement Page 4'!$D$22,LEN('Supplement Page 4'!$D$22)-6)),\"\")","v":""},false]
[null,null,null,null,null,null,null,null,null,false,{"$f":"IF($J31=TRUE,IF('Supplement Page 4'!$B$27=\"\",\"\",'Supplement Page 4'!$B$27),\"\")","v":""},{"$f":"IF($J31=TRUE,IF('Supplement Page 4'!$C$27=\"\",\"\",'Supplement Page 4'!$C$27),\"\")","v":""},{"$f":"IF(J31=TRUE,IF('Supplement Page 4'!$D$26=\"\",\"\",LEFT('Supplement Page 4'!$D$26,LEN('Supplement Page 4'!$D$26)-6)),\"\")","v":""},false]
[null,null,null,null,null,null,null,null,null,false,{"$f":"IF($J32=TRUE,IF('Supplement Page 4'!$B$31=\"\",\"\",'Supplement Page 4'!$B$31),\"\")","v":""},{"$f":"IF($J32=TRUE,IF('Supplement Page 4'!$C$31=\"\",\"\",'Supplement Page 4'!$C$31),\"\")","v":""},{"$f":"IF(J32=TRUE,IF('Supplement Page 4'!$D$30=\"\",\"\",LEFT('Supplement Page 4'!$D$30,LEN('Supplement Page 4'!$D$30)-6)),\"\")","v":""},false]
[null,null,null,null,null,null,null,null,null,false,{"$f":"IF($J33=TRUE,IF('Supplement Page 4'!$B$35=\"\",\"\",'Supplement Page 4'!$B$35),\"\")","v":""},{"$f":"IF($J33=TRUE,IF('Supplement Page 4'!$C$35=\"\",\"\",'Supplement Page 4'!$C$35),\"\")","v":""},{"$f":"IF(J33=TRUE,IF('Supplement Page 4'!$D$34=\"\",\"\",LEFT('Supplement Page 4'!$D$34,LEN('Supplement Page 4'!$D$34)-6)),\"\")","v":""},false]
[null,null,null,null,null,null,null,null,null,false,{"$f":"IF($J34=TRUE,IF('Supplement Page 4'!$B$39=\"\",\"\",'Supplement Page 4'!$B$39),\"\")","v":""},{"$f":"IF($J34=TRUE,IF('Supplement Page 4'!$C$39=\"\",\"\",'Supplement Page 4'!$C$39),\"\")","v":""},{"$f":"IF(J34=TRUE,IF('Supplement Page 4'!$D$38=\"\",\"\",LEFT('Supplement Page 4'!$D$38,LEN('Supplement Page 4'!$D$38)-6)),\"\")","v":""},false]
[null,null,null,null,null,null,null,null,null,false,{"$f":"IF($J35=TRUE,IF('Supplement Page 4'!$B$43=\"\",\"\",'Supplement Page 4'!$B$43),\"\")","v":""},{"$f":"IF($J35=TRUE,IF('Supplement Page 4'!$C$43=\"\",\"\",'Supplement Page 4'!$C$43),\"\")","v":""},{"$f":"IF(J35=TRUE,IF('Supplement Page 4'!$D$42=\"\",\"\",LEFT('Supplement Page 4'!$D$42,LEN('Supplement Page 4'!$D$42)-6)),\"\")","v":""},false]
[null,null,null,null,null,null,null,null,null,false,{"$f":"IF($J36=TRUE,IF('Supplement Page 5'!$B$7=\"\",\"\",'Supplement Page 5'!$B$7),\"\")","v":""},{"$f":"IF($J36=TRUE,IF('Supplement Page 5'!$C$7=\"\",\"\",'Supplement Page 5'!$C$7),\"\")","v":""},{"$f":"IF(J36=TRUE,IF('Supplement Page 5'!$D$6=\"\",\"\",LEFT('Supplement Page 5'!$D$6,LEN('Supplement Page 5'!$D$6)-6)),\"\")","v":""},false]
[null,null,null,null,null,null,null,null,null,false,{"$f":"IF($J37=TRUE,IF('Supplement Page 5'!$B$11=\"\",\"\",'Supplement Page 5'!$B$11),\"\")","v":""},{"$f":"IF($J37=TRUE,IF('Supplement Page 5'!$C$11=\"\",\"\",'Supplement Page 5'!$C$11),\"\")","v":""},{"$f":"IF(J37=TRUE,IF('Supplement Page 5'!$D$10=\"\",\"\",LEFT('Supplement Page 5'!$D$10,LEN('Supplement Page 5'!$D$10)-6)),\"\")","v":""},false]
[null,null,null,null,null,null,null,null,null,false,{"$f":"IF($J38=TRUE,IF('Supplement Page 5'!$B$15=\"\",\"\",'Supplement Page 5'!$B$15),\"\")","v":""},{"$f":"IF($J38=TRUE,IF('Supplement Page 5'!$C$15=\"\",\"\",'Supplement Page 5'!$C$15),\"\")","v":""},{"$f":"IF(J38=TRUE,IF('Supplement Page 5'!$D$14=\"\",\"\",LEFT('Supplement Page 5'!$D$14,LEN('Supplement Page 5'!$D$14)-6)),\"\")","v":""},false]
[null,null,null,null,null,null,null,null,null,false,{"$f":"IF($J39=TRUE,IF('Supplement Page 5'!$B$19=\"\",\"\",'Supplement Page 5'!$B$19),\"\")","v":""},{"$f":"IF($J39=TRUE,IF('Supplement Page 5'!$C$19=\"\",\"\",'Supplement Page 5'!$C$19),\"\")","v":""},{"$f":"IF(J39=TRUE,IF('Supplement Page 5'!$D$18=\"\",\"\",LEFT('Supplement Page 5'!$D$18,LEN('Supplement Page 5'!$D$18)-6)),\"\")","v":""},false]
[null,null,null,null,null,null,null,null,null,false,{"$f":"IF($J40=TRUE,IF('Supplement Page 5'!$B$23=\"\",\"\",'Supplement Page 5'!$B$23),\"\")","v":""},{"$f":"IF($J40=TRUE,IF('Supplement Page 5'!$C$23=\"\",\"\",'Supplement Page 5'!$C$23),\"\")","v":""},{"$f":"IF(J40=TRUE,IF('Supplement Page 5'!$D$22=\"\",\"\",LEFT('Supplement Page 5'!$D$22,LEN('Supplement Page 5'!$D$22)-6)),\"\")","v":""},false]
[null,null,null,null,null,null,null,null,null,false,{"$f":"IF($J41=TRUE,IF('Supplement Page 5'!$B$27=\"\",\"\",'Supplement Page 5'!$B$27),\"\")","v":""},{"$f":"IF($J41=TRUE,IF('Supplement Page 5'!$C$27=\"\",\"\",'Supplement Page 5'!$C$27),\"\")","v":""},{"$f":"IF(J41=TRUE,IF('Supplement Page 5'!$D$26=\"\",\"\",LEFT('Supplement Page 5'!$D$26,LEN('Supplement Page 5'!$D$26)-6)),\"\")","v":""},false]
[null,null,null,null,null,null,null,null,null,false,{"$f":"IF($J42=TRUE,IF('Supplement Page 5'!$B$31=\"\",\"\",'Supplement Page 5'!$B$31),\"\")","v":""},{"$f":"IF($J42=TRUE,IF('Supplement Page 5'!$C$31=\"\",\"\",'Supplement Page 5'!$C$31),\"\")","v":""},{"$f":"IF(J42=TRUE,IF('Supplement Page 5'!$D$30=\"\",\"\",LEFT('Supplement Page 5'!$D$30,LEN('Supplement Page 5'!$D$30)-6)),\"\")","v":""},false]
[null,null,null,null,null,null,null,null,null,false,{"$f":"IF($J43=TRUE,IF('Supplement Page 5'!$B$35=\"\",\"\",'Supplement Page 5'!$B$35),\"\")","v":""},{"$f":"IF($J43=TRUE,IF('Supplement Page 5'!$C$35=\"\",\"\",'Supplement Page 5'!$C$35),\"\")","v":""},{"$f":"IF(J43=TRUE,IF('Supplement Page 5'!$D$34=\"\",\"\",LEFT('Supplement Page 5'!$D$34,LEN('Supplement Page 5'!$D$34)-6)),\"\")","v":""},false]
[null,null,null,null,null,null,null,null,null,false,{"$f":"IF($J44=TRUE,IF('Supplement Page 5'!$B$39=\"\",\"\",'Supplement Page 5'!$B$39),\"\")","v":""},{"$f":"IF($J44=TRUE,IF('Supplement Page 5'!$C$39=\"\",\"\",'Supplement Page 5'!$C$39),\"\")","v":""},{"$f":"IF(J44=TRUE,IF('Supplement Page 5'!$D$38=\"\",\"\",LEFT('Supplement Page 5'!$D$38,LEN('Supplement Page 5'!$D$38)-6)),\"\")","v":""},false]
[null,null,null,null,null,null,null,null,null,false,{"$f":"IF($J45=TRUE,IF('Supplement Page 5'!$B$43=\"\",\"\",'Supplement Page 5'!$B$43),\"\")","v":""},{"$f":"IF($J45=TRUE,IF('Supplement Page 5'!$C$43=\"\",\"\",'Supplement Page 5'!$C$43),\"\")","v":""},{"$f":"IF(J45=TRUE,IF('Supplement Page 5'!$D$42=\"\",\"\",LEFT('Supplement Page 5'!$D$42,LEN('Supplement Page 5'!$D$42)-6)),\"\")","v":""},false]
[null,null,null,null,null,null,null,null,null,false,{"$f":"IF($J46=TRUE,IF('Supplement Page 6'!$B$7=\"\",\"\",'Supplement Page 6'!$B$7),\"\")","v":""},{"$f":"IF($J46=TRUE,IF('Supplement Page 6'!$C$7=\"\",\"\",'Supplement Page 6'!$C$7),\"\")","v":""},{"$f":"IF(J46=TRUE,IF('Supplement Page 6'!$D$6=\"\",\"\",LEFT('Supplement Page 6'!$D$6,LEN('Supplement Page 6'!$D$6)-6)),\"\")","v":""},false]
[null,null,null,null,null,null,null,null,null,false,{"$f":"IF($J47=TRUE,IF('Supplement Page 6'!$B$11=\"\",\"\",'Supplement Page 6'!$B$11),\"\")","v":""},{"$f":"IF($J47=TRUE,IF('Supplement Page 6'!$C$11=\"\",\"\",'Supplement Page 6'!$C$11),\"\")","v":""},{"$f":"IF(J47=TRUE,IF('Supplement Page 6'!$D$10=\"\",\"\",LEFT('Supplement Page 6'!$D$10,LEN('Supplement Page 6'!$D$10)-6)),\"\")","v":""},false]
[null,null,null,null,null,null,null,null,null,false,{"$f":"IF($J48=TRUE,IF('Supplement Page 6'!$B$15=\"\",\"\",'Supplement Page 6'!$B$15),\"\")","v":""},{"$f":"IF($J48=TRUE,IF('Supplement Page 6'!$C$15=\"\",\"\",'Supplement Page 6'!$C$15),\"\")","v":""},{"$f":"IF(J48=TRUE,IF('Supplement Page 6'!$D$14=\"\",\"\",LEFT('Supplement Page 6'!$D$14,LEN('Supplement Page 6'!$D$14)-6)),\"\")","v":""},false]
[null,null,null,null,null,null,null,null,null,false,{"$f":"IF($J49=TRUE,IF('Supplement Page 6'!$B$19=\"\",\"\",'Supplement Page 6'!$B$19),\"\")","v":""},{"$f":"IF($J49=TRUE,IF('Supplement Page 6'!$C$19=\"\",\"\",'Supplement Page 6'!$C$19),\"\")","v":""},{"$f":"IF(J49=TRUE,IF('Supplement Page 6'!$D$18=\"\",\"\",LEFT('Supplement Page 6'!$D$18,LEN('Supplement Page 6'!$D$18)-6)),\"\")","v":""},false]
[null,null,null,null,null,null,null,null,null,false,{"$f":"IF($J50=TRUE,IF('Supplement Page 6'!$B$23=\"\",\"\",'Supplement Page 6'!$B$23),\"\")","v":""},{"$f":"IF($J50=TRUE,IF('Supplement Page 6'!$C$23=\"\",\"\",'Supplement Page 6'!$C$23),\"\")","v":""},{"$f":"IF(J50=TRUE,IF('Supplement Page 6'!$D$22=\"\",\"\",LEFT('Supplement Page 6'!$D$22,LEN('Supplement Page 6'!$D$22)-6)),\"\")","v":""},false]
[null,null,null,null,null,null,null,null,null,false,{"$f":"IF($J51=TRUE,IF('Supplement Page 6'!$B$27=\"\",\"\",'Supplement Page 6'!$B$27),\"\")","v":""},{"$f":"IF($J51=TRUE,IF('Supplement Page 6'!$C$27=\"\",\"\",'Supplement Page 6'!$C$27),\"\")","v":""},{"$f":"IF(J51=TRUE,IF('Supplement Page 6'!$D$26=\"\",\"\",LEFT('Supplement Page 6'!$D$26,LEN('Supplement Page 6'!$D$26)-6)),\"\")","v":""},false]
[null,null,null,null,null,null,null,null,null,false,{"$f":"IF($J52=TRUE,IF('Supplement Page 6'!$B$31=\"\",\"\",'Supplement Page 6'!$B$31),\"\")","v":""},{"$f":"IF($J52=TRUE,IF('Supplement Page 6'!$C$31=\"\",\"\",'Supplement Page 6'!$C$31),\"\")","v":""},{"$f":"IF(J52=TRUE,IF('Supplement Page 6'!$D$30=\"\",\"\",LEFT('Supplement Page 6'!$D$30,LEN('Supplement Page 6'!$D$30)-6)),\"\")","v":""},false]
[null,null,null,null,null,null,null,null,null,false,{"$f":"IF($J53=TRUE,IF('Supplement Page 6'!$B$35=\"\",\"\",'Supplement Page 6'!$B$35),\"\")","v":""},{"$f":"IF($J53=TRUE,IF('Supplement Page 6'!$C$35=\"\",\"\",'Supplement Page 6'!$C$35),\"\")","v":""},{"$f":"IF(J53=TRUE,IF('Supplement Page 6'!$D$34=\"\",\"\",LEFT('Supplement Page 6'!$D$34,LEN('Supplement Page 6'!$D$34)-6)),\"\")","v":""},false]
[null,null,null,null,null,null,null,null,null,false,{"$f":"IF($J54=TRUE,IF('Supplement Page 6'!$B$39=\"\",\"\",'Supplement Page 6'!$B$39),\"\")","v":""},{"$f":"IF($J54=TRUE,IF('Supplement Page 6'!$C$39=\"\",\"\",'Supplement Page 6'!$C$39),\"\")","v":""},{"$f":"IF(J54=TRUE,IF('Supplement Page 6'!$D$38=\"\",\"\",LEFT('Supplement Page 6'!$D$38,LEN('Supplement Page 6'!$D$38)-6)),\"\")","v":""},false]
[null,null,null,null,null,null,null,null,null,false,{"$f":"IF($J55=TRUE,IF('Supplement Page 6'!$B$43=\"\",\"\",'Supplement Page 6'!$B$43),\"\")","v":""},{"$f":"IF($J55=TRUE,IF('Supplement Page 6'!$C$43=\"\",\"\",'Supplement Page 6'!$C$43),\"\")","v":""},{"$f":"IF(J55=TRUE,IF('Supplement Page 6'!$D$42=\"\",\"\",LEFT('Supplement Page 6'!$D$42,LEN('Supplement Page 6'!$D$42)-6)),\"\")","v":""},false]
[null,null,null,null,null,null,null,null,null,false,{"$f":"IF($J56=TRUE,IF('Supplement Page 7'!$B$7=\"\",\"\",'Supplement Page 7'!$B$7),\"\")","v":""},{"$f":"IF($J56=TRUE,IF('Supplement Page 7'!$C$7=\"\",\"\",'Supplement Page 7'!$C$7),\"\")","v":""},{"$f":"IF(J56=TRUE,IF('Supplement Page 7'!$D$6=\"\",\"\",LEFT('Supplement Page 7'!$D$6,LEN('Supplement Page 7'!$D$6)-6)),\"\")","v":""},false]
[null,null,null,null,null,null,null,null,null,false,{"$f":"IF($J57=TRUE,IF('Supplement Page 7'!$B$11=\"\",\"\",'Supplement Page 7'!$B$11),\"\")","v":""},{"$f":"IF($J57=TRUE,IF('Supplement Page 7'!$C$11=\"\",\"\",'Supplement Page 7'!$C$11),\"\")","v":""},{"$f":"IF(J57=TRUE,IF('Supplement Page 7'!$D$10=\"\",\"\",LEFT('Supplement Page 7'!$D$10,LEN('Supplement Page 7'!$D$10)-6)),\"\")","v":""},false]
[null,null,null,null,null,null,null,null,null,false,{"$f":"IF($J58=TRUE,IF('Supplement Page 7'!$B$15=\"\",\"\",'Supplement Page 7'!$B$15),\"\")","v":""},{"$f":"IF($J58=TRUE,IF('Supplement Page 7'!$C$15=\"\",\"\",'Supplement Page 7'!$C$15),\"\")","v":""},{"$f":"IF(J58=TRUE,IF('Supplement Page 7'!$D$14=\"\",\"\",LEFT('Supplement Page 7'!$D$14,LEN('Supplement Page 7'!$D$14)-6)),\"\")","v":""},false]
[null,null,null,null,null,null,null,null,null,false,{"$f":"IF($J59=TRUE,IF('Supplement Page 7'!$B$19=\"\",\"\",'Supplement Page 7'!$B$19),\"\")","v":""},{"$f":"IF($J59=TRUE,IF('Supplement Page 7'!$C$19=\"\",\"\",'Supplement Page 7'!$C$19),\"\")","v":""},{"$f":"IF(J59=TRUE,IF('Supplement Page 7'!$D$18=\"\",\"\",LEFT('Supplement Page 7'!$D$18,LEN('Supplement Page 7'!$D$18)-6)),\"\")","v":""},false]
[null,null,null,null,null,null,null,null,null,false,{"$f":"IF($J60=TRUE,IF('Supplement Page 7'!$B$23=\"\",\"\",'Supplement Page 7'!$B$23),\"\")","v":""},{"$f":"IF($J60=TRUE,IF('Supplement Page 7'!$C$23=\"\",\"\",'Supplement Page 7'!$C$23),\"\")","v":""},{"$f":"IF(J60=TRUE,IF('Supplement Page 7'!$D$22=\"\",\"\",LEFT('Supplement Page 7'!$D$22,LEN('Supplement Page 7'!$D$22)-6)),\"\")","v":""},false]
[null,null,null,null,null,null,null,null,null,false,{"$f":"IF($J61=TRUE,IF('Supplement Page 7'!$B$27=\"\",\"\",'Supplement Page 7'!$B$27),\"\")","v":""},{"$f":"IF($J61=TRUE,IF('Supplement Page 7'!$C$27=\"\",\"\",'Supplement Page 7'!$C$27),\"\")","v":""},{"$f":"IF(J61=TRUE,IF('Supplement Page 7'!$D$26=\"\",\"\",LEFT('Supplement Page 7'!$D$26,LEN('Supplement Page 7'!$D$26)-6)),\"\")","v":""},false]
[null,null,null,null,null,null,null,null,null,false,{"$f":"IF($J62=TRUE,IF('Supplement Page 7'!$B$31=\"\",\"\",'Supplement Page 7'!$B$31),\"\")","v":""},{"$f":"IF($J62=TRUE,IF('Supplement Page 7'!$C$31=\"\",\"\",'Supplement Page 7'!$C$31),\"\")","v":""},{"$f":"IF(J62=TRUE,IF('Supplement Page 7'!$D$30=\"\",\"\",LEFT('Supplement Page 7'!$D$30,LEN('Supplement Page 7'!$D$30)-6)),\"\")","v":""},false]
[null,null,null,null,null,null,null,null,null,false,{"$f":"IF($J63=TRUE,IF('Supplement Page 7'!$B$35=\"\",\"\",'Supplement Page 7'!$B$35),\"\")","v":""},{"$f":"IF($J63=TRUE,IF('Supplement Page 7'!$C$35=\"\",\"\",'Supplement Page 7'!$C$35),\"\")","v":""},{"$f":"IF(J63=TRUE,IF('Supplement Page 7'!$D$34=\"\",\"\",LEFT('Supplement Page 7'!$D$34,LEN('Supplement Page 7'!$D$34)-6)),\"\")","v":""},false]
[null,null,null,null,null,null,null,null,null,false,{"$f":"IF($J64=TRUE,IF('Supplement Page 7'!$B$39=\"\",\"\",'Supplement Page 7'!$B$39),\"\")","v":""},{"$f":"IF($J64=TRUE,IF('Supplement Page 7'!$C$39=\"\",\"\",'Supplement Page 7'!$C$39),\"\")","v":""},{"$f":"IF(J64=TRUE,IF('Supplement Page 7'!$D$38=\"\",\"\",LEFT('Supplement Page 7'!$D$38,LEN('Supplement Page 7'!$D$38)-6)),\"\")","v":""},false]
[null,null,null,null,null,null,null,null,null,false,{"$f":"IF($J65=TRUE,IF('Supplement Page 7'!$B$43=\"\",\"\",'Supplement Page 7'!$B$43),\"\")","v":""},{"$f":"IF($J65=TRUE,IF('Supplement Page 7'!$C$43=\"\",\"\",'Supplement Page 7'!$C$43),\"\")","v":""},{"$f":"IF(J65=TRUE,IF('Supplement Page 7'!$D$42=\"\",\"\",LEFT('Supplement Page 7'!$D$42,LEN('Supplement Page 7'!$D$42)-6)),\"\")","v":""},false]
[null,null,null,null,null,null,null,null,null,false,{"$f":"IF($J66=TRUE,IF('Supplement Page 8'!$B$7=\"\",\"\",'Supplement Page 8'!$B$7),\"\")","v":""},{"$f":"IF($J66=TRUE,IF('Supplement Page 8'!$C$7=\"\",\"\",'Supplement Page 8'!$C$7),\"\")","v":""},{"$f":"IF(J66=TRUE,IF('Supplement Page 8'!$D$6=\"\",\"\",LEFT('Supplement Page 8'!$D$6,LEN('Supplement Page 8'!$D$6)-6)),\"\")","v":""},false]
[null,null,null,null,null,null,null,null,null,false,{"$f":"IF($J67=TRUE,IF('Supplement Page 8'!$B$11=\"\",\"\",'Supplement Page 8'!$B$11),\"\")","v":""},{"$f":"IF($J67=TRUE,IF('Supplement Page 8'!$C$11=\"\",\"\",'Supplement Page 8'!$C$11),\"\")","v":""},{"$f":"IF(J67=TRUE,IF('Supplement Page 8'!$D$10=\"\",\"\",LEFT('Supplement Page 8'!$D$10,LEN('Supplement Page 8'!$D$10)-6)),\"\")","v":""},false]
[null,null,null,null,null,null,null,null,null,false,{"$f":"IF($J68=TRUE,IF('Supplement Page 8'!$B$15=\"\",\"\",'Supplement Page 8'!$B$15),\"\")","v":""},{"$f":"IF($J68=TRUE,IF('Supplement Page 8'!$C$15=\"\",\"\",'Supplement Page 8'!$C$15),\"\")","v":""},{"$f":"IF(J68=TRUE,IF('Supplement Page 8'!$D$14=\"\",\"\",LEFT('Supplement Page 8'!$D$14,LEN('Supplement Page 8'!$D$14)-6)),\"\")","v":""},false]
[null,null,null,null,null,null,null,null,null,false,{"$f":"IF($J69=TRUE,IF('Supplement Page 8'!$B$19=\"\",\"\",'Supplement Page 8'!$B$19),\"\")","v":""},{"$f":"IF($J69=TRUE,IF('Supplement Page 8'!$C$19=\"\",\"\",'Supplement Page 8'!$C$19),\"\")","v":""},{"$f":"IF(J69=TRUE,IF('Supplement Page 8'!$D$18=\"\",\"\",LEFT('Supplement Page 8'!$D$18,LEN('Supplement Page 8'!$D$18)-6)),\"\")","v":""},false]
[null,null,null,null,null,null,null,null,null,false,{"$f":"IF($J70=TRUE,IF('Supplement Page 8'!$B$23=\"\",\"\",'Supplement Page 8'!$B$23),\"\")","v":""},{"$f":"IF($J70=TRUE,IF('Supplement Page 8'!$C$23=\"\",\"\",'Supplement Page 8'!$C$23),\"\")","v":""},{"$f":"IF(J70=TRUE,IF('Supplement Page 8'!$D$22=\"\",\"\",LEFT('Supplement Page 8'!$D$22,LEN('Supplement Page 8'!$D$22)-6)),\"\")","v":""},false]
[null,null,null,null,null,null,null,null,null,false,{"$f":"IF($J71=TRUE,IF('Supplement Page 8'!$B$27=\"\",\"\",'Supplement Page 8'!$B$27),\"\")","v":""},{"$f":"IF($J71=TRUE,IF('Supplement Page 8'!$C$27=\"\",\"\",'Supplement Page 8'!$C$27),\"\")","v":""},{"$f":"IF(J71=TRUE,IF('Supplement Page 8'!$D$26=\"\",\"\",LEFT('Supplement Page 8'!$D$26,LEN('Supplement Page 8'!$D$26)-6)),\"\")","v":""},false]
[null,null,null,null,null,null,null,null,null,false,{"$f":"IF($J72=TRUE,IF('Supplement Page 8'!$B$31=\"\",\"\",'Supplement Page 8'!$B$31),\"\")","v":""},{"$f":"IF($J72=TRUE,IF('Supplement Page 8'!$C$31=\"\",\"\",'Supplement Page 8'!$C$31),\"\")","v":""},{"$f":"IF(J72=TRUE,IF('Supplement Page 8'!$D$30=\"\",\"\",LEFT('Supplement Page 8'!$D$30,LEN('Supplement Page 8'!$D$30)-6)),\"\")","v":""},false]
[null,null,null,null,null,null,null,null,null,false,{"$f":"IF($J73=TRUE,IF('Supplement Page 8'!$B$35=\"\",\"\",'Supplement Page 8'!$B$35),\"\")","v":""},{"$f":"IF($J73=TRUE,IF('Supplement Page 8'!$C$35=\"\",\"\",'Supplement Page 8'!$C$35),\"\")","v":""},{"$f":"IF(J73=TRUE,IF('Supplement Page 8'!$D$34=\"\",\"\",LEFT('Supplement Page 8'!$D$34,LEN('Supplement Page 8'!$D$34)-6)),\"\")","v":""},false]
[null,null,null,null,null,null,null,null,null,false,{"$f":"IF($J74=TRUE,IF('Supplement Page 8'!$B$39=\"\",\"\",'Supplement Page 8'!$B$39),\"\")","v":""},{"$f":"IF($J74=TRUE,IF('Supplement Page 8'!$C$39=\"\",\"\",'Supplement Page 8'!$C$39),\"\")","v":""},{"$f":"IF(J74=TRUE,IF('Supplement Page 8'!$D$38=\"\",\"\",LEFT('Supplement Page 8'!$D$38,LEN('Supplement Page 8'!$D$38)-6)),\"\")","v":""},false]
[null,null,null,null,null,null,null,null,null,false,{"$f":"IF($J75=TRUE,IF('Supplement Page 8'!$B$43=\"\",\"\",'Supplement Page 8'!$B$43),\"\")","v":""},{"$f":"IF($J75=TRUE,IF('Supplement Page 8'!$C$43=\"\",\"\",'Supplement Page 8'!$C$43),\"\")","v":""},{"$f":"IF(J75=TRUE,IF('Supplement Page 8'!$D$42=\"\",\"\",LEFT('Supplement Page 8'!$D$42,LEN('Supplement Page 8'!$D$42)-6)),\"\")","v":""},false]

{"sheet":"Sheet2","index":22,"n_rows":4,"n_cols":1,"rows_kept":4,"cut":false,"hidden":true,"merged":[]}
[]
["YES"]
["NO"]
["DO NOT KNOW"]